BDBM286101 US10617673, Example 1a (4'R)::US9517228, Example 1a (4'R)::US9987253, Example 1a
SMILES: NC(=O)CN\C(=N/S(=O)(=O)c1ccc(Cl)cc1)N1C[C@H](C(=N1)c1ccc(Cl)cc1)c1ccccc1
InChI Key: InChIKey=RARSOSZGLZWADN-NRFANRHFSA-N
Data: 3 IC50
Activity Spreadsheet -- Enzyme Inhibition Constant Data from BindingDB
Found 3 hits for monomerid = 286101
Trg + Lig
Ki
nM
ΔG°
kcal/mole
IC50
nM
Kd
nM
EC50/IC50
nM
koff
s-1
kon
M-1s-1
pHTemp
°C
Cannabinoid receptor 1
(Homo sapiens (Human))
BDBM286101
(US10617673, Example 1a (4'R) | US9517228, Example ...)
Show SMILES NC(=O)CN\C(=N/S(=O)(=O)c1ccc(Cl)cc1)N1C[C@H](C(=N1)c1ccc(Cl)cc1)c1ccccc1 |r,c:21|
Show InChI InChI=1S/C24H21Cl2N5O3S/c25-18-8-6-17(7-9-18)23-21(16-4-2-1-3-5-16)15-31(29-23)24(28-14-22(27)32)30-35(33,34)20-12-10-19(26)11-13-20/h1-13,21H,14-15H2,(H2,27,32)(H,28,30)/t21-/m0/s1
NCI pathway
Reactome pathway
US Patent
n/an/a>1.00E+3n/an/an/an/an/an/a
Jenrin Discovery, Inc.
US Patent
Assay Description
Compound binding to CB1R was assessed in competition displacement assays using [3H]CP-55,940 as the radioligand and crude membranes from mouse brain....
US Patent US9517228 (2016)
BindingDB Entry DOI: 10.7270/Q2M90BPD
Cannabinoid receptor 1
(Mus musculus (Mouse))
BDBM286101
(US10617673, Example 1a (4'R) | US9517228, Example ...)
Show SMILES NC(=O)CN\C(=N/S(=O)(=O)c1ccc(Cl)cc1)N1C[C@H](C(=N1)c1ccc(Cl)cc1)c1ccccc1 |r,c:21|
Show InChI InChI=1S/C24H21Cl2N5O3S/c25-18-8-6-17(7-9-18)23-21(16-4-2-1-3-5-16)15-31(29-23)24(28-14-22(27)32)30-35(33,34)20-12-10-19(26)11-13-20/h1-13,21H,14-15H2,(H2,27,32)(H,28,30)/t21-/m0/s1
US Patent
n/an/a>1.00E+3n/an/an/an/an/an/a
Jenrin Discovery, LLC
US Patent
Assay Description
Compound binding to CB1R was assessed in competition displacement assays using [3H]CP-55,940 as the radioligand and crude membranes from mouse brain....
US Patent US10617673 (2020)
Cannabinoid receptor 1
(Mus musculus (Mouse))
BDBM286101
(US10617673, Example 1a (4'R) | US9517228, Example ...)
Show SMILES NC(=O)CN\C(=N/S(=O)(=O)c1ccc(Cl)cc1)N1C[C@H](C(=N1)c1ccc(Cl)cc1)c1ccccc1 |r,c:21|
Show InChI InChI=1S/C24H21Cl2N5O3S/c25-18-8-6-17(7-9-18)23-21(16-4-2-1-3-5-16)15-31(29-23)24(28-14-22(27)32)30-35(33,34)20-12-10-19(26)11-13-20/h1-13,21H,14-15H2,(H2,27,32)(H,28,30)/t21-/m0/s1
US Patent
n/an/a 5.50E+3n/an/an/an/an/an/a
University of Newcastle upon Tyne
Assay Description
Compound binding to CB1R was assessed in competition displacement assays using [3H]CP-55,940 as the radioligand and crude membranes from mouse brain....
J Med Chem 49: 6209-21 (2006)
BindingDB Entry DOI: 10.7270/Q25T3NT6