BDBM286106 US10617673, Example 4::US9517228, Example 4 (2S,4′S)::US9987253, Example 4
SMILES: CC(C)[C@H](N\C(=N/S(=O)(=O)c1ccc(Cl)cc1)N1C[C@@H](C(=N1)c1ccc(Cl)cc1)c1ccccc1)C(N)=O
InChI Key: InChIKey=GTCSIQFTNPTSLO-RPWUZVMVSA-N
Data: 3 IC50
Activity Spreadsheet -- Enzyme Inhibition Constant Data from BindingDB
Found 3 hits for monomerid = 286106
Trg + Lig
Ki
nM
ΔG°
kcal/mole
IC50
nM
Kd
nM
EC50/IC50
nM
koff
s-1
kon
M-1s-1
pHTemp
°C
Cannabinoid receptor 1
(Homo sapiens (Human))
BDBM286106
(US10617673, Example 4 | US9517228, Example 4 (2S,4...)
Show SMILES CC(C)[C@H](N\C(=N/S(=O)(=O)c1ccc(Cl)cc1)N1C[C@@H](C(=N1)c1ccc(Cl)cc1)c1ccccc1)C(N)=O |r,c:21|
Show InChI InChI=1S/C27H27Cl2N5O3S/c1-17(2)24(26(30)35)31-27(33-38(36,37)22-14-12-21(29)13-15-22)34-16-23(18-6-4-3-5-7-18)25(32-34)19-8-10-20(28)11-9-19/h3-15,17,23-24H,16H2,1-2H3,(H2,30,35)(H,31,33)/t23-,24+/m1/s1
NCI pathway
Reactome pathway
US Patent
n/an/a<100n/an/an/an/an/an/a
Jenrin Discovery, Inc.
US Patent
Assay Description
Compound binding to CB1R was assessed in competition displacement assays using [3H]CP-55,940 as the radioligand and crude membranes from mouse brain....
US Patent US9517228 (2016)
BindingDB Entry DOI: 10.7270/Q2M90BPD
Cannabinoid receptor 1
(Mus musculus (Mouse))
BDBM286106
(US10617673, Example 4 | US9517228, Example 4 (2S,4...)
Show SMILES CC(C)[C@H](N\C(=N/S(=O)(=O)c1ccc(Cl)cc1)N1C[C@@H](C(=N1)c1ccc(Cl)cc1)c1ccccc1)C(N)=O |r,c:21|
Show InChI InChI=1S/C27H27Cl2N5O3S/c1-17(2)24(26(30)35)31-27(33-38(36,37)22-14-12-21(29)13-15-22)34-16-23(18-6-4-3-5-7-18)25(32-34)19-8-10-20(28)11-9-19/h3-15,17,23-24H,16H2,1-2H3,(H2,30,35)(H,31,33)/t23-,24+/m1/s1
US Patent
n/an/a<100n/an/an/an/an/an/a
Jenrin Discovery, LLC
US Patent
Assay Description
Compound binding to CB1R was assessed in competition displacement assays using [3H]CP-55,940 as the radioligand and crude membranes from mouse brain....
US Patent US10617673 (2020)
Cannabinoid receptor 1
(Mus musculus (Mouse))
BDBM286106
(US10617673, Example 4 | US9517228, Example 4 (2S,4...)
Show SMILES CC(C)[C@H](N\C(=N/S(=O)(=O)c1ccc(Cl)cc1)N1C[C@@H](C(=N1)c1ccc(Cl)cc1)c1ccccc1)C(N)=O |r,c:21|
Show InChI InChI=1S/C27H27Cl2N5O3S/c1-17(2)24(26(30)35)31-27(33-38(36,37)22-14-12-21(29)13-15-22)34-16-23(18-6-4-3-5-7-18)25(32-34)19-8-10-20(28)11-9-19/h3-15,17,23-24H,16H2,1-2H3,(H2,30,35)(H,31,33)/t23-,24+/m1/s1
US Patent
n/an/a>100n/an/an/an/an/an/a
University of Newcastle upon Tyne
Assay Description
Compound binding to CB1R was assessed in competition displacement assays using [3H]CP-55,940 as the radioligand and crude membranes from mouse brain....
J Med Chem 49: 6209-21 (2006)
BindingDB Entry DOI: 10.7270/Q25T3NT6