null
SMILES: COc1nn2cc(nc2s1)-c1cc2c(OCc3cccc(c3)-c3ccc(Cl)nc3)cc(OC)cc2o1
InChI Key: InChIKey=DPJKUHSMDUAPGF-UHFFFAOYSA-N
Activity Spreadsheet -- Enzyme Inhibition Constant Data from BindingDB
Found 1 hit for monomerid = 286440
Trg + Lig
Ki
nM
ΔG°
kcal/mole
IC50
nM
Kd
nM
EC50/IC50
nM
koff
s-1
kon
M-1s-1
pHTemp
°C
Proteinase-activated receptor 4
(Homo sapiens (Human))
BDBM286440
(US9518064, Example 56)
Show SMILES COc1nn2cc(nc2s1)-c1cc2c(OCc3cccc(c3)-c3ccc(Cl)nc3)cc(OC)cc2o1
Show InChI InChI=1S/C26H19ClN4O4S/c1-32-18-9-21(34-14-15-4-3-5-16(8-15)17-6-7-24(27)28-12-17)19-11-23(35-22(19)10-18)20-13-31-25(29-20)36-26(30-31)33-2/h3-13H,14H2,1-2H3
US Patent
n/an/a 0.740n/an/an/an/an/a25
Bristol-Myers Squibb Company; Universite De Montreal
US Patent
Assay Description
The activity of the PAR4 antagonists of the present invention were tested in PAR4 expressing cells by monitoring H-Ala-Phe(4-F)-Pro-Gly-Trp-Leu-Val-L...
US Patent US9518064 (2016)
BindingDB Entry DOI: 10.7270/Q2TT4SZX