BDBM286493 (S)-2-(1-Fluoroethyl)-6-(6-methoxy-4-((6-(4-methoxytetrahydro-2H-pyran-4-yl)pyridin-2-yl)methoxy)benzofuran-2-yl)imidazo[2,1-b][1,3,4]thiadiazole::US9518064, Example 112
SMILES: COc1cc(OCc2cccc(n2)C2(CCOCC2)OC)c2cc(oc2c1)-c1cn2nc(sc2n1)[C@H](C)F
InChI Key: InChIKey=ZOVYPYLKDRJEGX-INIZCTEOSA-N
Data: 1 IC50
Activity Spreadsheet -- Enzyme Inhibition Constant Data from BindingDB
Found 1 hit for monomerid = 286493
Trg + Lig
Ki
nM
ΔG°
kcal/mole
IC50
nM
Kd
nM
EC50/IC50
nM
koff
s-1
kon
M-1s-1
pHTemp
°C
Proteinase-activated receptor 4 (PAR4)
(Homo sapiens (Human))
BDBM286493
((S)-2-(1-Fluoroethyl)-6-(6-methoxy-4-((6-(4-methox...)
Show SMILES COc1cc(OCc2cccc(n2)C2(CCOCC2)OC)c2cc(oc2c1)-c1cn2nc(sc2n1)[C@H](C)F |r|
Show InChI InChI=1S/C27H27FN4O5S/c1-16(28)25-31-32-14-20(30-26(32)38-25)23-13-19-21(11-18(33-2)12-22(19)37-23)36-15-17-5-4-6-24(29-17)27(34-3)7-9-35-10-8-27/h4-6,11-14,16H,7-10,15H2,1-3H3/t16-/m0/s1
US Patent
n/an/a 0.360n/an/an/an/an/a25
Bristol-Myers Squibb Company; Universite De Montreal
US Patent
Assay Description
The activity of the PAR4 antagonists of the present invention were tested in PAR4 expressing cells by monitoring H-Ala-Phe(4-F)-Pro-Gly-Trp-Leu-Val-L...
US Patent US9518064 (2016)
BindingDB Entry DOI: 10.7270/Q2TT4SZX