BDBM286528 US9566312, Compound 2.5.9
SMILES: CC[C@@H]1NC(=O)[C@H]([C@H](O)[C@H](C)C\C=C\C)N(C)C(=O)[C@H](C(C)C)N(C)C(=O)[C@H](CC(C)C)N(C)C(=O)[C@H](CC(C)C)N(C)C(=O)[C@@H](C)NC(=O)[C@H](C)NC(=O)[C@H](CC(C)C)N(C)C(=O)[C@@H](NC(=O)[C@H]([C@H](C)COC(=O)N2CCN(C)CC2)N(C)C(=O)[C@@H](C)N(C)C1=O)C(C)C
InChI Key: InChIKey=FERLVNZMHHKHEM-FNRRWBIXSA-N
Data: 3 Kd
Activity Spreadsheet -- Enzyme Inhibition Constant Data from BindingDB
Found 3 hits for monomerid = 286528
Trg + Lig
Ki
nM
ΔG°
kcal/mole
IC50
nM
Kd
nM
EC50/IC50
nM
koff
s-1
kon
M-1s-1
pHTemp
°C
Cyclophilin A
(Homo sapiens (Human))
BDBM286528
(US9566312, Compound 2.5.9)
Show SMILES CC[C@@H]1NC(=O)[C@H]([C@H](O)[C@H](C)C\C=C\C)N(C)C(=O)[C@H](C(C)C)N(C)C(=O)[C@H](CC(C)C)N(C)C(=O)[C@H](CC(C)C)N(C)C(=O)[C@@H](C)NC(=O)[C@H](C)NC(=O)[C@H](CC(C)C)N(C)C(=O)[C@@H](NC(=O)[C@H]([C@H](C)COC(=O)N2CCN(C)CC2)N(C)C(=O)[C@@H](C)N(C)C1=O)C(C)C |r|
Show InChI InChI=1S/C68H121N13O14/c1-26-28-29-43(13)56(82)55-60(86)71-48(27-2)63(89)74(19)47(17)62(88)79(24)54(44(14)37-95-68(94)81-32-30-73(18)31-33-81)59(85)72-52(41(9)10)66(92)75(20)49(34-38(3)4)58(84)69-45(15)57(83)70-46(16)61(87)76(21)50(35-39(5)6)64(90)77(22)51(36-40(7)8)65(91)78(23)53(42(11)12)67(93)80(55)25/h26,28,38-56,82H,27,29-37H2,1-25H3,(H,69,84)(H,70,83)(H,71,86)(H,72,85)/b28-26+/t43-,44-,45+,46-,47-,48+,49+,50+,51+,52+,53+,54+,55+,56-/m1/s1
Reactome pathway
US Patent
n/an/an/a 0.800n/an/an/a7.4n/a
Novartis AG
US Patent
Assay Description
Binding of inhibitors to expressed cyclophilins was determined using surface plasmon resonance (SPR) experiments. Briefly, avi-tagged cyclophilin pro...
US Patent US9566312 (2017)
BindingDB Entry DOI: 10.7270/Q2K939J1
Peptidyl-prolyl cis-trans isomerase F, mitochondrial
(Homo sapiens (Human))
BDBM286528
(US9566312, Compound 2.5.9)
Show SMILES CC[C@@H]1NC(=O)[C@H]([C@H](O)[C@H](C)C\C=C\C)N(C)C(=O)[C@H](C(C)C)N(C)C(=O)[C@H](CC(C)C)N(C)C(=O)[C@H](CC(C)C)N(C)C(=O)[C@@H](C)NC(=O)[C@H](C)NC(=O)[C@H](CC(C)C)N(C)C(=O)[C@@H](NC(=O)[C@H]([C@H](C)COC(=O)N2CCN(C)CC2)N(C)C(=O)[C@@H](C)N(C)C1=O)C(C)C |r|
Show InChI InChI=1S/C68H121N13O14/c1-26-28-29-43(13)56(82)55-60(86)71-48(27-2)63(89)74(19)47(17)62(88)79(24)54(44(14)37-95-68(94)81-32-30-73(18)31-33-81)59(85)72-52(41(9)10)66(92)75(20)49(34-38(3)4)58(84)69-45(15)57(83)70-46(16)61(87)76(21)50(35-39(5)6)64(90)77(22)51(36-40(7)8)65(91)78(23)53(42(11)12)67(93)80(55)25/h26,28,38-56,82H,27,29-37H2,1-25H3,(H,69,84)(H,70,83)(H,71,86)(H,72,85)/b28-26+/t43-,44-,45+,46-,47-,48+,49+,50+,51+,52+,53+,54+,55+,56-/m1/s1
US Patent
n/an/an/a 0.300n/an/an/a7.4n/a
Novartis AG
US Patent
Assay Description
Binding of inhibitors to expressed cyclophilins was determined using surface plasmon resonance (SPR) experiments. Briefly, avi-tagged cyclophilin pro...
US Patent US9566312 (2017)
BindingDB Entry DOI: 10.7270/Q2K939J1
Cyclophilin B (CypB)
(Homo sapiens (Human))
BDBM286528
(US9566312, Compound 2.5.9)
Show SMILES CC[C@@H]1NC(=O)[C@H]([C@H](O)[C@H](C)C\C=C\C)N(C)C(=O)[C@H](C(C)C)N(C)C(=O)[C@H](CC(C)C)N(C)C(=O)[C@H](CC(C)C)N(C)C(=O)[C@@H](C)NC(=O)[C@H](C)NC(=O)[C@H](CC(C)C)N(C)C(=O)[C@@H](NC(=O)[C@H]([C@H](C)COC(=O)N2CCN(C)CC2)N(C)C(=O)[C@@H](C)N(C)C1=O)C(C)C |r|
Show InChI InChI=1S/C68H121N13O14/c1-26-28-29-43(13)56(82)55-60(86)71-48(27-2)63(89)74(19)47(17)62(88)79(24)54(44(14)37-95-68(94)81-32-30-73(18)31-33-81)59(85)72-52(41(9)10)66(92)75(20)49(34-38(3)4)58(84)69-45(15)57(83)70-46(16)61(87)76(21)50(35-39(5)6)64(90)77(22)51(36-40(7)8)65(91)78(23)53(42(11)12)67(93)80(55)25/h26,28,38-56,82H,27,29-37H2,1-25H3,(H,69,84)(H,70,83)(H,71,86)(H,72,85)/b28-26+/t43-,44-,45+,46-,47-,48+,49+,50+,51+,52+,53+,54+,55+,56-/m1/s1
Reactome pathway
US Patent
n/an/an/a 0.5n/an/an/a7.4n/a
Novartis AG
US Patent
Assay Description
Binding of inhibitors to expressed cyclophilins was determined using surface plasmon resonance (SPR) experiments. Briefly, avi-tagged cyclophilin pro...
US Patent US9566312 (2017)
BindingDB Entry DOI: 10.7270/Q2K939J1