BDBM28682 5-methyl-2-({3-[(4-methyl-1H-indole-1-)sulfonyl]benzene}amido)benzoic acid::Anthranilic acid deriv., 20
SMILES: Cc1ccc(NC(=O)c2cccc(c2)S(=O)(=O)n2ccc3c(C)cccc23)c(c1)C(O)=O
InChI Key: InChIKey=YEBXBTNDAOBSJZ-UHFFFAOYSA-N
Data: 9 IC50  1 EC50
Activity Spreadsheet -- Enzyme Inhibition Constant Data from BindingDB
Found 9 hits for monomerid = 28682
Trg + Lig
Ki
nM
ΔG°
kcal/mole
IC50
nM
Kd
nM
EC50/IC50
nM
koff
s-1
kon
M-1s-1
pHTemp
°C
Peroxisome proliferator-activated receptor delta
(Homo sapiens (Human))
BDBM28682
(5-methyl-2-({3-[(4-methyl-1H-indole-1-)sulfonyl]be...)
Show SMILES Cc1ccc(NC(=O)c2cccc(c2)S(=O)(=O)n2ccc3c(C)cccc23)c(c1)C(O)=O
Show InChI InChI=1S/C24H20N2O5S/c1-15-9-10-21(20(13-15)24(28)29)25-23(27)17-6-4-7-18(14-17)32(30,31)26-12-11-19-16(2)5-3-8-22(19)26/h3-14H,1-2H3,(H,25,27)(H,28,29)
n/an/a 6n/a 20n/an/an/an/a
GSK
Assay Description
Competition-binding curves for test compounds were determined with expressed human PPAR LBD. Plots of inhibitor concentration versus cpm of radioliga...
Bioorg Med Chem Lett 18: 5018-22 (2008)
Article DOI: 10.1016/j.bmcl.2008.08.011
BindingDB Entry DOI: 10.7270/Q2WD3XWS
Peroxisome proliferator-activated receptor alpha (PPAR alpha)
(Homo sapiens (Human))
BDBM28682
(5-methyl-2-({3-[(4-methyl-1H-indole-1-)sulfonyl]be...)
Show SMILES Cc1ccc(NC(=O)c2cccc(c2)S(=O)(=O)n2ccc3c(C)cccc23)c(c1)C(O)=O
Show InChI InChI=1S/C24H20N2O5S/c1-15-9-10-21(20(13-15)24(28)29)25-23(27)17-6-4-7-18(14-17)32(30,31)26-12-11-19-16(2)5-3-8-22(19)26/h3-14H,1-2H3,(H,25,27)(H,28,29)
n/an/a 1.00E+3n/an/an/an/an/an/a
GSK
Assay Description
Competition-binding curves for test compounds were determined with expressed human PPAR LBD. Plots of inhibitor concentration versus cpm of radioliga...
Bioorg Med Chem Lett 18: 5018-22 (2008)
Article DOI: 10.1016/j.bmcl.2008.08.011
BindingDB Entry DOI: 10.7270/Q2WD3XWS
Peroxisome proliferator-activated receptor
(Homo sapiens (Human))
BDBM28682
(5-methyl-2-({3-[(4-methyl-1H-indole-1-)sulfonyl]be...)
Show SMILES Cc1ccc(NC(=O)c2cccc(c2)S(=O)(=O)n2ccc3c(C)cccc23)c(c1)C(O)=O
Show InChI InChI=1S/C24H20N2O5S/c1-15-9-10-21(20(13-15)24(28)29)25-23(27)17-6-4-7-18(14-17)32(30,31)26-12-11-19-16(2)5-3-8-22(19)26/h3-14H,1-2H3,(H,25,27)(H,28,29)
NCI pathway
Reactome pathway
n/an/a 2.00E+3n/an/an/an/an/an/a
GSK
Assay Description
Competition-binding curves for test compounds were determined with expressed human PPAR LBD. Plots of inhibitor concentration versus cpm of radioliga...
Bioorg Med Chem Lett 18: 5018-22 (2008)
Article DOI: 10.1016/j.bmcl.2008.08.011
BindingDB Entry DOI: 10.7270/Q2WD3XWS
Peroxisome proliferator-activated receptor alpha (PPAR alpha)
(Homo sapiens (Human))
BDBM28682
(5-methyl-2-({3-[(4-methyl-1H-indole-1-)sulfonyl]be...)
Show SMILES Cc1ccc(NC(=O)c2cccc(c2)S(=O)(=O)n2ccc3c(C)cccc23)c(c1)C(O)=O
Show InChI InChI=1S/C24H20N2O5S/c1-15-9-10-21(20(13-15)24(28)29)25-23(27)17-6-4-7-18(14-17)32(30,31)26-12-11-19-16(2)5-3-8-22(19)26/h3-14H,1-2H3,(H,25,27)(H,28,29)
n/an/a 1.00E+3n/an/an/an/an/an/a
Universidad Nacional Aut£noma de M£xico
Curated by ChEMBL
Assay Description
Agonist activity at PPARalpha
Bioorg Med Chem 20: 3523-32 (2012)
Article DOI: 10.1016/j.bmc.2012.04.005
BindingDB Entry DOI: 10.7270/Q2MP54B4
Peroxisome proliferator-activated receptor
(Homo sapiens (Human))
BDBM28682
(5-methyl-2-({3-[(4-methyl-1H-indole-1-)sulfonyl]be...)
Show SMILES Cc1ccc(NC(=O)c2cccc(c2)S(=O)(=O)n2ccc3c(C)cccc23)c(c1)C(O)=O
Show InChI InChI=1S/C24H20N2O5S/c1-15-9-10-21(20(13-15)24(28)29)25-23(27)17-6-4-7-18(14-17)32(30,31)26-12-11-19-16(2)5-3-8-22(19)26/h3-14H,1-2H3,(H,25,27)(H,28,29)
NCI pathway
Reactome pathway
n/an/a 2.00E+3n/an/an/an/an/an/a
Universidad Nacional Aut£noma de M£xico
Curated by ChEMBL
Assay Description
Agonist activity at PPARgamma
Bioorg Med Chem 20: 3523-32 (2012)
Article DOI: 10.1016/j.bmc.2012.04.005
BindingDB Entry DOI: 10.7270/Q2MP54B4
Peroxisome proliferator-activated receptor alpha (PPAR alpha)
(Homo sapiens (Human))
BDBM28682
(5-methyl-2-({3-[(4-methyl-1H-indole-1-)sulfonyl]be...)
Show SMILES Cc1ccc(NC(=O)c2cccc(c2)S(=O)(=O)n2ccc3c(C)cccc23)c(c1)C(O)=O
Show InChI InChI=1S/C24H20N2O5S/c1-15-9-10-21(20(13-15)24(28)29)25-23(27)17-6-4-7-18(14-17)32(30,31)26-12-11-19-16(2)5-3-8-22(19)26/h3-14H,1-2H3,(H,25,27)(H,28,29)
n/an/a 1.00E+3n/an/an/an/an/an/a
Universidad Nacional Aut£noma de M£xico
Curated by ChEMBL
Assay Description
Agonist activity at PPARalpha
Bioorg Med Chem 20: 3523-32 (2012)
Article DOI: 10.1016/j.bmc.2012.04.005
BindingDB Entry DOI: 10.7270/Q2MP54B4
Peroxisome proliferator-activated receptor delta
(Homo sapiens (Human))
BDBM28682
(5-methyl-2-({3-[(4-methyl-1H-indole-1-)sulfonyl]be...)
Show SMILES Cc1ccc(NC(=O)c2cccc(c2)S(=O)(=O)n2ccc3c(C)cccc23)c(c1)C(O)=O
Show InChI InChI=1S/C24H20N2O5S/c1-15-9-10-21(20(13-15)24(28)29)25-23(27)17-6-4-7-18(14-17)32(30,31)26-12-11-19-16(2)5-3-8-22(19)26/h3-14H,1-2H3,(H,25,27)(H,28,29)
n/an/a 6n/an/an/an/an/an/a
Universidad Nacional Aut£noma de M£xico
Curated by ChEMBL
Assay Description
Agonist activity at PPARdelta
Bioorg Med Chem 20: 3523-32 (2012)
Article DOI: 10.1016/j.bmc.2012.04.005
BindingDB Entry DOI: 10.7270/Q2MP54B4
Peroxisome proliferator-activated receptor
(Homo sapiens (Human))
BDBM28682
(5-methyl-2-({3-[(4-methyl-1H-indole-1-)sulfonyl]be...)
Show SMILES Cc1ccc(NC(=O)c2cccc(c2)S(=O)(=O)n2ccc3c(C)cccc23)c(c1)C(O)=O
Show InChI InChI=1S/C24H20N2O5S/c1-15-9-10-21(20(13-15)24(28)29)25-23(27)17-6-4-7-18(14-17)32(30,31)26-12-11-19-16(2)5-3-8-22(19)26/h3-14H,1-2H3,(H,25,27)(H,28,29)
NCI pathway
Reactome pathway
n/an/a 2.00E+3n/an/an/an/an/an/a
Universidad Nacional Aut£noma de M£xico
Curated by ChEMBL
Assay Description
Agonist activity at PPARgamma
Bioorg Med Chem 20: 3523-32 (2012)
Article DOI: 10.1016/j.bmc.2012.04.005
BindingDB Entry DOI: 10.7270/Q2MP54B4
Peroxisome proliferator-activated receptor delta
(Homo sapiens (Human))
BDBM28682
(5-methyl-2-({3-[(4-methyl-1H-indole-1-)sulfonyl]be...)
Show SMILES Cc1ccc(NC(=O)c2cccc(c2)S(=O)(=O)n2ccc3c(C)cccc23)c(c1)C(O)=O
Show InChI InChI=1S/C24H20N2O5S/c1-15-9-10-21(20(13-15)24(28)29)25-23(27)17-6-4-7-18(14-17)32(30,31)26-12-11-19-16(2)5-3-8-22(19)26/h3-14H,1-2H3,(H,25,27)(H,28,29)
n/an/a 6n/an/an/an/an/an/a
Universidad Nacional Aut£noma de M£xico
Curated by ChEMBL
Assay Description
Agonist activity at PPARdelta
Bioorg Med Chem 20: 3523-32 (2012)
Article DOI: 10.1016/j.bmc.2012.04.005
BindingDB Entry DOI: 10.7270/Q2MP54B4