BDBM288 (2S)-2-[(2S)-2-[(2S)-2-{[4-({[(6S)-2-amino-5-formyl-4-oxo-1,4,5,6,7,8-hexahydropteridin-6-yl]methyl}amino)phenyl]formamido}-4-formamidobutanoic acid]-4-formamidobutanoic acid]pentanedioic acid::5-CHO-H4PteGlu3
SMILES: Nc1nc2NC[C@H](CNc3ccc(cc3)C(=O)N[C@@H](CCC(=O)N[C@@H](CCC(=O)N[C@@H](CCC(O)=O)C(O)=O)C(O)=O)C(O)=O)N(C=O)c2c(=O)[nH]1
InChI Key: InChIKey=ZLOMJLIQXBKNHU-VJANTYMQSA-N
Data: 1 ITC
PDB links: 1 PDB ID matches this monomer.
Activity Spreadsheet -- ITC Data from BindingDB
Found 1 hit for monomerid = 288
Cell (A)Syringe (B)Cell
Syringe
Cell + Syr
ΔG°
kcal/mole
-TΔS°
kcal/mole
ΔH°
kcal/mole
log KpHTemp
°C
Serine Hydroxymethyltransferase
(Oryctolagus cuniculus (rabbit))
BDBM288
JPEG
((2S)-2-[(2S)-2-[(2S)-2-{[4-({[(6S)-2-amino-5-formy...)
-9.68n/a5.897.17n/a25
Virginia Commonwealth University
Biochemistry 37: 13536-42 (1998)