BDBM288028 US10087178, Example 9
SMILES: CC(C)N1C[C@@]2(C[C@@H]2CO)n2cc(C(=O)NCc3ccc(F)cc3F)c(=O)c(O)c2C1=O
InChI Key: InChIKey=XZDZCFVXXILMOA-MCMMXHMISA-N
Data: 1 EC50
Activity Spreadsheet -- Enzyme Inhibition Constant Data from BindingDB
Found 1 hit for monomerid = 288028
Trg + Lig
Ki
nM
ΔG°
kcal/mole
IC50
nM
Kd
nM
EC50/IC50
nM
koff
s-1
kon
M-1s-1
pHTemp
°C
HIV-1 Nef
(Human immunodeficiency virus type 1 (isolate BRU/L...)
BDBM288028
(US10087178, Example 9)
Show SMILES CC(C)N1C[C@@]2(C[C@@H]2CO)n2cc(C(=O)NCc3ccc(F)cc3F)c(=O)c(O)c2C1=O |r|
Show InChI InChI=1S/C22H23F2N3O5/c1-11(2)26-10-22(6-13(22)9-28)27-8-15(18(29)19(30)17(27)21(26)32)20(31)25-7-12-3-4-14(23)5-16(12)24/h3-5,8,11,13,28,30H,6-7,9-10H2,1-2H3,(H,25,31)/t13-,22-/m1/s1
US Patent
n/an/an/an/a 5.60n/an/an/a25
JAPAN TOBACCO INC.
US Patent
Assay Description
The medium (40 μL), a test substance (10 μL) diluted with the medium, and a 1×105 cells/mL MT-4 cell suspension (50 μL) wherein HIV-1 ...
US Patent US10087178 (2018)
BindingDB Entry DOI: 10.7270/Q20C4XSD