BDBM288044 N-(2,4-difluorobenzyl)-cis- 3,9'-dihydroxy-2'-isopropyl- 1',8'-dioxo-1',2',3',8'- tetrahydrospiro[cyclobutane- 1,4'-pyrido[1,2-a]pyrazine]- 7'-carboxamide::US10087178, Example S4
SMILES: CC(C)N1C[C@]2(C[C@H](O)C2)n2cc(C(=O)NCc3ccc(F)cc3F)c(=O)c(O)c2C1=O
InChI Key: InChIKey=DVHOLILOXHRZNE-XLOAEROZSA-N
Data: 1 EC50
Activity Spreadsheet -- Enzyme Inhibition Constant Data from BindingDB
Found 1 hit for monomerid = 288044
Trg + Lig
Ki
nM
ΔG°
kcal/mole
IC50
nM
Kd
nM
EC50/IC50
nM
koff
s-1
kon
M-1s-1
pHTemp
°C
Protein Nef
(Human immunodeficiency virus type 1 (isolate BRU/L...)
BDBM288044
(N-(2,4-difluorobenzyl)-cis- 3,9'-dihydroxy-2'-isop...)
Show SMILES CC(C)N1C[C@]2(C[C@H](O)C2)n2cc(C(=O)NCc3ccc(F)cc3F)c(=O)c(O)c2C1=O |r,wU:5.9,wD:7.7,(7.34,4.17,;7.34,2.63,;8.67,1.86,;6,1.86,;6,.32,;4.67,-.45,;5.76,-1.54,;4.67,-2.63,;4.67,-4.17,;3.58,-1.54,;3.33,.32,;2,-.45,;.67,.32,;-.67,-.45,;-.67,-1.99,;-2,.32,;-3.33,-.45,;-4.67,.32,;-4.67,1.86,;-6,2.63,;-7.34,1.86,;-8.67,2.63,;-7.34,.32,;-6,-.45,;-6,-1.99,;.67,1.86,;-.67,2.63,;2,2.63,;2,4.17,;3.33,1.86,;4.67,2.63,;4.67,4.17,)|
Show InChI InChI=1S/C22H23F2N3O5/c1-11(2)26-10-22(6-14(28)7-22)27-9-15(18(29)19(30)17(27)21(26)32)20(31)25-8-12-3-4-13(23)5-16(12)24/h3-5,9,11,14,28,30H,6-8,10H2,1-2H3,(H,25,31)/t14-,22+
US Patent
n/an/an/an/a 4.90n/an/an/a25
JAPAN TOBACCO INC.
US Patent
Assay Description
The medium (40 μL), a test substance (10 μL) diluted with the medium, and a 1×105 cells/mL MT-4 cell suspension (50 μL) wherein HIV-1 ...
US Patent US10087178 (2018)
BindingDB Entry DOI: 10.7270/Q20C4XSD