BDBM288061 N-(2,4-difluorobenzyl)-cis- 3-ethoxy-2'-ethyl-9'- hydroxy-1',8'-dioxo- 1',2',3',8'- tetrahydrospiro[cyclobutane- 1,4'-pyrido[1,2-a]pyrazine]- 7'-carboxamide hydrochloride::US10087178, Example S21
SMILES: CCO[C@H]1C[C@@]2(C1)CN(CC)C(=O)c1c(O)c(=O)c(cn21)C(=O)NCc1ccc(F)cc1F
InChI Key: InChIKey=JFZVGHMKLNOFJY-GUJKFWMDSA-N
Data: 1 EC50
Activity Spreadsheet -- Enzyme Inhibition Constant Data from BindingDB
Found 1 hit for monomerid = 288061
Trg + Lig
Ki
nM
ΔG°
kcal/mole
IC50
nM
Kd
nM
EC50/IC50
nM
koff
s-1
kon
M-1s-1
pHTemp
°C
Protein Nef
(Human immunodeficiency virus type 1 (isolate BRU/L...)
BDBM288061
(N-(2,4-difluorobenzyl)-cis- 3-ethoxy-2'-ethyl-9'- ...)
Show SMILES CCO[C@H]1C[C@@]2(C1)CN(CC)C(=O)c1c(O)c(=O)c(cn21)C(=O)NCc1ccc(F)cc1F |r,wU:5.5,wD:3.2,(7.34,-3.78,;6,-4.55,;4.67,-3.78,;4.67,-2.24,;5.76,-1.15,;4.67,-.07,;3.58,-1.15,;6,.7,;6,2.24,;7.34,3.01,;8.67,2.24,;4.67,3.01,;4.67,4.55,;3.33,2.24,;2,3.01,;2,4.55,;.67,2.24,;-.67,3.01,;.67,.7,;2,-.07,;3.33,.7,;-.67,-.07,;-.67,-1.61,;-2,.7,;-3.33,-.07,;-4.67,.7,;-4.67,2.24,;-6,3.01,;-7.34,2.24,;-8.67,3.01,;-7.34,.7,;-6,-.07,;-6,-1.61,)|
Show InChI InChI=1S/C23H25F2N3O5/c1-3-27-12-23(8-15(9-23)33-4-2)28-11-16(19(29)20(30)18(28)22(27)32)21(31)26-10-13-5-6-14(24)7-17(13)25/h5-7,11,15,30H,3-4,8-10,12H2,1-2H3,(H,26,31)/t15-,23+
US Patent
n/an/an/an/a 3.80n/an/an/a25
JAPAN TOBACCO INC.
US Patent
Assay Description
The medium (40 μL), a test substance (10 μL) diluted with the medium, and a 1×105 cells/mL MT-4 cell suspension (50 μL) wherein HIV-1 ...
US Patent US10087178 (2018)
BindingDB Entry DOI: 10.7270/Q20C4XSD