BDBM288335 US10087187, Compound 25::US10087187, Compound 27
SMILES: CC1CN(CCO1)c1cc(-c2c[nH]cn2)c2nc(CO)c(Cc3cccc(c3C)C(F)(F)F)n2n1
InChI Key:
Data: 10 Kd
Activity Spreadsheet -- Enzyme Inhibition Constant Data from BindingDB
Found 10 hits for monomerid = 288335
Trg + Lig
Ki
nM
ΔG°
kcal/mole
IC50
nM
Kd
nM
EC50/IC50
nM
koff
s-1
kon
M-1s-1
pHTemp
°C
Phosphatidylinositol 4-phosphate 3-kinase C2 domain-containing subunit alpha
(Homo sapiens (Human))
BDBM288335
(US10087187, Compound 25 | US10087187, Compound 27)
Show SMILES CC1CN(CCO1)c1cc(-c2c[nH]cn2)c2nc(CO)c(Cc3cccc(c3C)C(F)(F)F)n2n1
US Patent
n/an/an/a>3.02E+4n/an/an/an/an/a
Janssen Pharmaceutica NV
US Patent
Assay Description
Kinase enzyme binding affinities of compounds disclosed herein were determined using the KINOMEscan technology performed by DiscoveRx Corporation, Sa...
US Patent US10087187 (2018)
BindingDB Entry DOI: 10.7270/Q2M61N9J
Phosphatidylinositol 4-phosphate 3-kinase C2 domain-containing subunit beta
(Homo sapiens (Human))
BDBM288335
(US10087187, Compound 25 | US10087187, Compound 27)
Show SMILES CC1CN(CCO1)c1cc(-c2c[nH]cn2)c2nc(CO)c(Cc3cccc(c3C)C(F)(F)F)n2n1
NCI pathway
Reactome pathway
US Patent
n/an/an/a 200n/an/an/an/an/a
Janssen Pharmaceutica NV
US Patent
Assay Description
Kinase enzyme binding affinities of compounds disclosed herein were determined using the KINOMEscan technology performed by DiscoveRx Corporation, Sa...
US Patent US10087187 (2018)
BindingDB Entry DOI: 10.7270/Q2M61N9J
Phosphatidylinositol 4,5-bisphosphate 3-kinase catalytic subunit delta isoform
(Homo sapiens (Human))
BDBM288335
(US10087187, Compound 25 | US10087187, Compound 27)
Show SMILES CC1CN(CCO1)c1cc(-c2c[nH]cn2)c2nc(CO)c(Cc3cccc(c3C)C(F)(F)F)n2n1
NCI pathway
Reactome pathway
US Patent
n/an/an/a>3.02E+4n/an/an/an/an/a
Janssen Pharmaceutica NV
US Patent
Assay Description
Kinase enzyme binding affinities of compounds disclosed herein were determined using the KINOMEscan technology performed by DiscoveRx Corporation, Sa...
US Patent US10087187 (2018)
BindingDB Entry DOI: 10.7270/Q2M61N9J
Phosphatidylinositol 4,5-bisphosphate 3-kinase catalytic subunit gamma isoform
(Homo sapiens (Human))
BDBM288335
(US10087187, Compound 25 | US10087187, Compound 27)
Show SMILES CC1CN(CCO1)c1cc(-c2c[nH]cn2)c2nc(CO)c(Cc3cccc(c3C)C(F)(F)F)n2n1
NCI pathway
Reactome pathway
US Patent
n/an/an/a>3.02E+4n/an/an/an/an/a
Janssen Pharmaceutica NV
US Patent
Assay Description
Kinase enzyme binding affinities of compounds disclosed herein were determined using the KINOMEscan technology performed by DiscoveRx Corporation, Sa...
US Patent US10087187 (2018)
BindingDB Entry DOI: 10.7270/Q2M61N9J
Serine/threonine-protein kinase mTOR
(Homo sapiens (Human))
BDBM288335
(US10087187, Compound 25 | US10087187, Compound 27)
Show SMILES CC1CN(CCO1)c1cc(-c2c[nH]cn2)c2nc(CO)c(Cc3cccc(c3C)C(F)(F)F)n2n1
NCI pathway
Reactome pathway
US Patent
n/an/an/a 447n/an/an/an/an/a
Janssen Pharmaceutica NV
US Patent
Assay Description
Kinase enzyme binding affinities of compounds disclosed herein were determined using the KINOMEscan technology performed by DiscoveRx Corporation, Sa...
US Patent US10087187 (2018)
BindingDB Entry DOI: 10.7270/Q2M61N9J
Phosphatidylinositol 4-phosphate 3-kinase C2 domain-containing subunit alpha
(Homo sapiens (Human))
BDBM288335
(US10087187, Compound 25 | US10087187, Compound 27)
Show SMILES CC1CN(CCO1)c1cc(-c2c[nH]cn2)c2nc(CO)c(Cc3cccc(c3C)C(F)(F)F)n2n1
US Patent
n/an/an/a 617n/an/an/an/an/a
Janssen Pharmaceutica NV
US Patent
Assay Description
Kinase enzyme binding affinities of compounds disclosed herein were determined using the KINOMEscan technology performed by DiscoveRx Corporation, Sa...
US Patent US10087187 (2018)
BindingDB Entry DOI: 10.7270/Q2M61N9J
Phosphatidylinositol 4-phosphate 3-kinase C2 domain-containing subunit beta
(Homo sapiens (Human))
BDBM288335
(US10087187, Compound 25 | US10087187, Compound 27)
Show SMILES CC1CN(CCO1)c1cc(-c2c[nH]cn2)c2nc(CO)c(Cc3cccc(c3C)C(F)(F)F)n2n1
NCI pathway
Reactome pathway
US Patent
n/an/an/a 2.40n/an/an/an/an/a
Janssen Pharmaceutica NV
US Patent
Assay Description
Kinase enzyme binding affinities of compounds disclosed herein were determined using the KINOMEscan technology performed by DiscoveRx Corporation, Sa...
US Patent US10087187 (2018)
BindingDB Entry DOI: 10.7270/Q2M61N9J
Phosphatidylinositol 4,5-bisphosphate 3-kinase catalytic subunit delta isoform
(Homo sapiens (Human))
BDBM288335
(US10087187, Compound 25 | US10087187, Compound 27)
Show SMILES CC1CN(CCO1)c1cc(-c2c[nH]cn2)c2nc(CO)c(Cc3cccc(c3C)C(F)(F)F)n2n1
NCI pathway
Reactome pathway
US Patent
n/an/an/a 58n/an/an/an/an/a
Janssen Pharmaceutica NV
US Patent
Assay Description
Kinase enzyme binding affinities of compounds disclosed herein were determined using the KINOMEscan technology performed by DiscoveRx Corporation, Sa...
US Patent US10087187 (2018)
BindingDB Entry DOI: 10.7270/Q2M61N9J
Phosphatidylinositol 4,5-bisphosphate 3-kinase catalytic subunit gamma isoform
(Homo sapiens (Human))
BDBM288335
(US10087187, Compound 25 | US10087187, Compound 27)
Show SMILES CC1CN(CCO1)c1cc(-c2c[nH]cn2)c2nc(CO)c(Cc3cccc(c3C)C(F)(F)F)n2n1
NCI pathway
Reactome pathway
US Patent
n/an/an/a 479n/an/an/an/an/a
Janssen Pharmaceutica NV
US Patent
Assay Description
Kinase enzyme binding affinities of compounds disclosed herein were determined using the KINOMEscan technology performed by DiscoveRx Corporation, Sa...
US Patent US10087187 (2018)
BindingDB Entry DOI: 10.7270/Q2M61N9J
Serine/threonine-protein kinase mTOR
(Homo sapiens (Human))
BDBM288335
(US10087187, Compound 25 | US10087187, Compound 27)
Show SMILES CC1CN(CCO1)c1cc(-c2c[nH]cn2)c2nc(CO)c(Cc3cccc(c3C)C(F)(F)F)n2n1
NCI pathway
Reactome pathway
US Patent
n/an/an/a 1.18E+3n/an/an/an/an/a
Janssen Pharmaceutica NV
US Patent
Assay Description
Kinase enzyme binding affinities of compounds disclosed herein were determined using the KINOMEscan technology performed by DiscoveRx Corporation, Sa...
US Patent US10087187 (2018)
BindingDB Entry DOI: 10.7270/Q2M61N9J