BDBM288386 US10087187, Compound 81
SMILES: CCC(C)C(N)C(=O)OCc1nc2c(N)cc(nn2c1Nc1cccc(c1C)C(F)(F)F)N1CCOCC1
InChI Key: InChIKey=CQFQJYXNXFQWDM-UHFFFAOYSA-N
Data: 5 Kd
Activity Spreadsheet -- Enzyme Inhibition Constant Data from BindingDB
Found 5 hits for monomerid = 288386
Trg + Lig
Ki
nM
ΔG°
kcal/mole
IC50
nM
Kd
nM
EC50/IC50
nM
koff
s-1
kon
M-1s-1
pHTemp
°C
Phosphatidylinositol 4-phosphate 3-kinase C2 domain-containing subunit alpha
(Homo sapiens (Human))
BDBM288386
(US10087187, Compound 81)
Show SMILES CCC(C)C(N)C(=O)OCc1nc2c(N)cc(nn2c1Nc1cccc(c1C)C(F)(F)F)N1CCOCC1
Show InChI InChI=1S/C25H32F3N7O3/c1-4-14(2)21(30)24(36)38-13-19-23(31-18-7-5-6-16(15(18)3)25(26,27)28)35-22(32-19)17(29)12-20(33-35)34-8-10-37-11-9-34/h5-7,12,14,21,31H,4,8-11,13,29-30H2,1-3H3
US Patent
n/an/an/a 2.69E+4n/an/an/an/an/a
Janssen Pharmaceutica NV
US Patent
Assay Description
Kinase enzyme binding affinities of compounds disclosed herein were determined using the KINOMEscan technology performed by DiscoveRx Corporation, Sa...
US Patent US10087187 (2018)
BindingDB Entry DOI: 10.7270/Q2M61N9J
Phosphatidylinositol 4-phosphate 3-kinase C2 domain-containing subunit beta
(Homo sapiens (Human))
BDBM288386
(US10087187, Compound 81)
Show SMILES CCC(C)C(N)C(=O)OCc1nc2c(N)cc(nn2c1Nc1cccc(c1C)C(F)(F)F)N1CCOCC1
Show InChI InChI=1S/C25H32F3N7O3/c1-4-14(2)21(30)24(36)38-13-19-23(31-18-7-5-6-16(15(18)3)25(26,27)28)35-22(32-19)17(29)12-20(33-35)34-8-10-37-11-9-34/h5-7,12,14,21,31H,4,8-11,13,29-30H2,1-3H3
NCI pathway
Reactome pathway
US Patent
n/an/an/a 5n/an/an/an/an/a
Janssen Pharmaceutica NV
US Patent
Assay Description
Kinase enzyme binding affinities of compounds disclosed herein were determined using the KINOMEscan technology performed by DiscoveRx Corporation, Sa...
US Patent US10087187 (2018)
BindingDB Entry DOI: 10.7270/Q2M61N9J
Serine/threonine-protein kinase mTOR
(Homo sapiens (Human))
BDBM288386
(US10087187, Compound 81)
Show SMILES CCC(C)C(N)C(=O)OCc1nc2c(N)cc(nn2c1Nc1cccc(c1C)C(F)(F)F)N1CCOCC1
Show InChI InChI=1S/C25H32F3N7O3/c1-4-14(2)21(30)24(36)38-13-19-23(31-18-7-5-6-16(15(18)3)25(26,27)28)35-22(32-19)17(29)12-20(33-35)34-8-10-37-11-9-34/h5-7,12,14,21,31H,4,8-11,13,29-30H2,1-3H3
NCI pathway
Reactome pathway
US Patent
n/an/an/a>3.02E+4n/an/an/an/an/a
Janssen Pharmaceutica NV
US Patent
Assay Description
Kinase enzyme binding affinities of compounds disclosed herein were determined using the KINOMEscan technology performed by DiscoveRx Corporation, Sa...
US Patent US10087187 (2018)
BindingDB Entry DOI: 10.7270/Q2M61N9J
Phosphatidylinositol 4,5-bisphosphate 3-kinase catalytic subunit gamma isoform
(Homo sapiens (Human))
BDBM288386
(US10087187, Compound 81)
Show SMILES CCC(C)C(N)C(=O)OCc1nc2c(N)cc(nn2c1Nc1cccc(c1C)C(F)(F)F)N1CCOCC1
Show InChI InChI=1S/C25H32F3N7O3/c1-4-14(2)21(30)24(36)38-13-19-23(31-18-7-5-6-16(15(18)3)25(26,27)28)35-22(32-19)17(29)12-20(33-35)34-8-10-37-11-9-34/h5-7,12,14,21,31H,4,8-11,13,29-30H2,1-3H3
NCI pathway
Reactome pathway
US Patent
n/an/an/a>3.02E+4n/an/an/an/an/a
Janssen Pharmaceutica NV
US Patent
Assay Description
Kinase enzyme binding affinities of compounds disclosed herein were determined using the KINOMEscan technology performed by DiscoveRx Corporation, Sa...
US Patent US10087187 (2018)
BindingDB Entry DOI: 10.7270/Q2M61N9J
Phosphatidylinositol 4,5-bisphosphate 3-kinase catalytic subunit delta isoform
(Homo sapiens (Human))
BDBM288386
(US10087187, Compound 81)
Show SMILES CCC(C)C(N)C(=O)OCc1nc2c(N)cc(nn2c1Nc1cccc(c1C)C(F)(F)F)N1CCOCC1
Show InChI InChI=1S/C25H32F3N7O3/c1-4-14(2)21(30)24(36)38-13-19-23(31-18-7-5-6-16(15(18)3)25(26,27)28)35-22(32-19)17(29)12-20(33-35)34-8-10-37-11-9-34/h5-7,12,14,21,31H,4,8-11,13,29-30H2,1-3H3
NCI pathway
Reactome pathway
US Patent
n/an/an/a 724n/an/an/an/an/a
Janssen Pharmaceutica NV
US Patent
Assay Description
Kinase enzyme binding affinities of compounds disclosed herein were determined using the KINOMEscan technology performed by DiscoveRx Corporation, Sa...
US Patent US10087187 (2018)
BindingDB Entry DOI: 10.7270/Q2M61N9J