BDBM288416 US10087188, Example 21
SMILES: CC1(CCC(C)(C1)c1nc(-c2ccc(cc2)C(=O)Nc2cc(ccn2)C(F)(F)F)c2c(N)nccn12)C(O)=O
InChI Key: InChIKey=SXVSUPYHNNTUMY-UHFFFAOYSA-N
Data: 1 IC50
Activity Spreadsheet -- Enzyme Inhibition Constant Data from BindingDB
Found 1 hit for monomerid = 288416
Trg + Lig
Ki
nM
ΔG°
kcal/mole
IC50
nM
Kd
nM
EC50/IC50
nM
koff
s-1
kon
M-1s-1
pHTemp
°C
Tyrosine-protein kinase BTK
(Homo sapiens (Human))
BDBM288416
(US10087188, Example 21)
Show SMILES CC1(CCC(C)(C1)c1nc(-c2ccc(cc2)C(=O)Nc2cc(ccn2)C(F)(F)F)c2c(N)nccn12)C(O)=O
Show InChI InChI=1S/C27H25F3N6O3/c1-25(8-9-26(2,14-25)24(38)39)23-35-19(20-21(31)33-11-12-36(20)23)15-3-5-16(6-4-15)22(37)34-18-13-17(7-10-32-18)27(28,29)30/h3-7,10-13H,8-9,14H2,1-2H3,(H2,31,33)(H,38,39)(H,32,34,37)
NCI pathway
Reactome pathway
US Patent
n/an/a 0.270n/an/an/an/an/an/a
Merck Sharp & Dohme Corp.
US Patent
Assay Description
BTK enzymatic activity was determined with the LANCE (Lanthanide Chelate Excite) TR-FRET (Time-resolved fluorescence resonance energy transfer) assay...
US Patent US10087188 (2018)
BindingDB Entry DOI: 10.7270/Q2GF0WJC