BDBM288690 TC001287::US10092529, Compound 15
SMILES: CCC(C)(C)C(=O)N1C[C@H](O)C[C@H]1c1ccccc1
InChI Key: InChIKey=XEQWFRKZGYCZAP-KGLIPLIRSA-N
Data: 1 KI
Activity Spreadsheet -- Enzyme Inhibition Constant Data from BindingDB
Found 1 hit for monomerid = 288690
Trg + Lig
Ki
nM
ΔG°
kcal/mole
IC50
nM
Kd
nM
EC50/IC50
nM
koff
s-1
kon
M-1s-1
pHTemp
°C
Receptor-interacting serine/threonine-protein kinase 1
(Homo sapiens (Human))
BDBM288690
(TC001287 | US10092529, Compound 15)
Show SMILES CCC(C)(C)C(=O)N1C[C@H](O)C[C@H]1c1ccccc1 |r|
Show InChI InChI=1S/C16H23NO2/c1-4-16(2,3)15(19)17-11-13(18)10-14(17)12-8-6-5-7-9-12/h5-9,13-14,18H,4,10-11H2,1-3H3/t13-,14+/m1/s1
US Patent
460 -8.64n/an/an/an/an/an/a25
National Institute of Biological Sciences, Beijing
US Patent
Assay Description
Materials: Recombinant full-length RIPK1 protein with N-terminal GST-tag (Cat#R07-34G) was purchased from SignalChem. The ADP-Glo kinase assay kit (C...
US Patent US10092529 (2018)
BindingDB Entry DOI: 10.7270/Q26W9D35