BDBM28939 (2S,3S)-N-(4-chloro-3-fluorophenyl)-1-hydroxy-3-methylpentane-2-sulfonamido::phenylsulfonamide, 2n
SMILES: CC[C@H](C)[C@@H](CO)NS(=O)(=O)c1ccc(Cl)c(F)c1
InChI Key: InChIKey=MCMRWUUZIULQHQ-QPUJVOFHSA-N
Data: 1 EC50
Activity Spreadsheet -- Enzyme Inhibition Constant Data from BindingDB
Found 1 hit for monomerid = 28939
Trg + Lig
Ki
nM
ΔG°
kcal/mole
IC50
nM
Kd
nM
EC50/IC50
nM
koff
s-1
kon
M-1s-1
pHTemp
°C
Gamma-secretase subunit APH-1A/Gamma-secretase subunit PEN-2/Nicastrin [34-709]/Presenilin-1
(Homo sapiens (Human))
BDBM28939
((2S,3S)-N-(4-chloro-3-fluorophenyl)-1-hydroxy-3-me...)
Show SMILES CC[C@H](C)[C@@H](CO)NS(=O)(=O)c1ccc(Cl)c(F)c1 |r|
Show InChI InChI=1S/C12H17ClFNO3S/c1-3-8(2)12(7-16)15-19(17,18)9-4-5-10(13)11(14)6-9/h4-6,8,12,15-16H,3,7H2,1-2H3/t8-,12+/m0/s1
NCI pathway
Reactome pathway
n/an/an/an/a 7.84E+3n/an/an/an/a
Wyeth Research
Assay Description
A Chinese Hamster Ovary cell line stably expressing human beta-APP were aliquoted into a 96-well plate, and after attachment the medium was replaced ...
Bioorg Med Chem Lett 18: 4232-6 (2008)
Article DOI: 10.1016/j.bmcl.2008.05.064
BindingDB Entry DOI: 10.7270/Q26Q1VJM