BDBM28958 (3S,4S)-N-(4-chlorophenyl)-2-hydroxy-4-methylhexane-3-sulfonamido::phenylsulfonamide, 15a
SMILES: CC[C@H](C)[C@H](NS(=O)(=O)c1ccc(Cl)cc1)C(C)O
InChI Key: InChIKey=KZKYPADPNWMKMZ-DZGIZQBRSA-N
Data: 1 EC50
Activity Spreadsheet -- Enzyme Inhibition Constant Data from BindingDB
Found 1 hit for monomerid = 28958
Trg + Lig
Ki
nM
ΔG°
kcal/mole
IC50
nM
Kd
nM
EC50/IC50
nM
koff
s-1
kon
M-1s-1
pHTemp
°C
Gamma-secretase subunit APH-1A/Gamma-secretase subunit PEN-2/Nicastrin [34-709]/Presenilin-1
(Homo sapiens (Human))
BDBM28958
((3S,4S)-N-(4-chlorophenyl)-2-hydroxy-4-methylhexan...)
Show SMILES CC[C@H](C)[C@H](NS(=O)(=O)c1ccc(Cl)cc1)C(C)O |r|
Show InChI InChI=1S/C13H20ClNO3S/c1-4-9(2)13(10(3)16)15-19(17,18)12-7-5-11(14)6-8-12/h5-10,13,15-16H,4H2,1-3H3/t9-,10?,13-/m0/s1
NCI pathway
Reactome pathway
n/an/an/an/a 4.93E+4n/an/an/an/a
Wyeth Research
Assay Description
A Chinese Hamster Ovary cell line stably expressing human beta-APP were aliquoted into a 96-well plate, and after attachment the medium was replaced ...
Bioorg Med Chem Lett 18: 4232-6 (2008)
Article DOI: 10.1016/j.bmcl.2008.05.064
BindingDB Entry DOI: 10.7270/Q26Q1VJM