BDBM28959 (3S,4S)-N-(4-chlorophenyl)-2-hydroxy-2,4-dimethylhexane-3-sulfonamido::phenylsulfonamide, 15b
SMILES: CC[C@H](C)[C@H](NS(=O)(=O)c1ccc(Cl)cc1)C(C)(C)O
InChI Key: InChIKey=OMPCCMVLPSZNMU-GWCFXTLKSA-N
Data: 1 EC50
Activity Spreadsheet -- Enzyme Inhibition Constant Data from BindingDB
Found 1 hit for monomerid = 28959
Trg + Lig
Ki
nM
ΔG°
kcal/mole
IC50
nM
Kd
nM
EC50/IC50
nM
koff
s-1
kon
M-1s-1
pHTemp
°C
Gamma-secretase subunit APH-1A/Gamma-secretase subunit PEN-2/Nicastrin [34-709]/Presenilin-1
(Homo sapiens (Human))
BDBM28959
((3S,4S)-N-(4-chlorophenyl)-2-hydroxy-2,4-dimethylh...)
Show SMILES CC[C@H](C)[C@H](NS(=O)(=O)c1ccc(Cl)cc1)C(C)(C)O |r|
Show InChI InChI=1S/C14H22ClNO3S/c1-5-10(2)13(14(3,4)17)16-20(18,19)12-8-6-11(15)7-9-12/h6-10,13,16-17H,5H2,1-4H3/t10-,13-/m0/s1
NCI pathway
Reactome pathway
n/an/an/an/a>1.00E+5n/an/an/an/a
Wyeth Research
Assay Description
A Chinese Hamster Ovary cell line stably expressing human beta-APP were aliquoted into a 96-well plate, and after attachment the medium was replaced ...
Bioorg Med Chem Lett 18: 4232-6 (2008)
Article DOI: 10.1016/j.bmcl.2008.05.064
BindingDB Entry DOI: 10.7270/Q26Q1VJM