null
SMILES: COc1cc-2c(CC(c3cccs3)n3cc(C(O)=O)c(=O)cc-23)cc1OCCCO
InChI Key: InChIKey=RUASNJZCIUVCKM-UHFFFAOYSA-N
Activity Spreadsheet -- Enzyme Inhibition Constant Data from BindingDB
Found 1 hit for monomerid = 289748
Trg + Lig
Ki
nM
ΔG°
kcal/mole
IC50
nM
Kd
nM
EC50/IC50
nM
koff
s-1
kon
M-1s-1
pHTemp
°C
Large envelope protein
(Hepatitis B virus)
BDBM289748
(US10093671, Example 17)
Show SMILES COc1cc-2c(CC(c3cccs3)n3cc(C(O)=O)c(=O)cc-23)cc1OCCCO
Show InChI InChI=1S/C22H21NO6S/c1-28-19-10-14-13(9-20(19)29-6-3-5-24)8-17(21-4-2-7-30-21)23-12-15(22(26)27)18(25)11-16(14)23/h2,4,7,9-12,17,24H,3,5-6,8H2,1H3,(H,26,27)
US Patent
n/an/a 18n/an/an/an/an/a25
Hoffmann-La Roche Inc.
US Patent
Assay Description
HepG2.2.15 cells were seeded in duplicate into white, 96-well plates at 1.5×104 cells/well. The cells were treated with a three-fold serial dilution ...
US Patent US10093671 (2018)
BindingDB Entry DOI: 10.7270/Q21838KR