BDBM289757 US10093671, Example 26
SMILES: COc1cc-2c(CC(c3cccs3)n3cc(C(O)=O)c(=O)cc-23)cc1OCC(C)(C)CO
InChI Key: InChIKey=VCBRSHMGKJLFAO-UHFFFAOYSA-N
Data: 1 IC50
Activity Spreadsheet -- Enzyme Inhibition Constant Data from BindingDB
Found 1 hit for monomerid = 289757
Trg + Lig
Ki
nM
ΔG°
kcal/mole
IC50
nM
Kd
nM
EC50/IC50
nM
koff
s-1
kon
M-1s-1
pHTemp
°C
Large envelope protein
(Hepatitis B virus)
BDBM289757
(US10093671, Example 26)
Show SMILES COc1cc-2c(CC(c3cccs3)n3cc(C(O)=O)c(=O)cc-23)cc1OCC(C)(C)CO
Show InChI InChI=1S/C24H25NO6S/c1-24(2,12-26)13-31-21-8-14-7-18(22-5-4-6-32-22)25-11-16(23(28)29)19(27)10-17(25)15(14)9-20(21)30-3/h4-6,8-11,18,26H,7,12-13H2,1-3H3,(H,28,29)
US Patent
n/an/a 4n/an/an/an/an/a25
Hoffmann-La Roche Inc.
US Patent
Assay Description
HepG2.2.15 cells were seeded in duplicate into white, 96-well plates at 1.5×104 cells/well. The cells were treated with a three-fold serial dilution ...
US Patent US10093671 (2018)
BindingDB Entry DOI: 10.7270/Q21838KR