BDBM289758 US10093671, Example 27
SMILES: COc1cc-2c(CC(c3cccs3)n3cc(C(O)=O)c(=O)cc-23)cc1OCC(F)(F)F
InChI Key: InChIKey=HBCZEIHZCYETAP-UHFFFAOYSA-N
Data: 1 IC50
Activity Spreadsheet -- Enzyme Inhibition Constant Data from BindingDB
Found 1 hit for monomerid = 289758
Trg + Lig
Ki
nM
ΔG°
kcal/mole
IC50
nM
Kd
nM
EC50/IC50
nM
koff
s-1
kon
M-1s-1
pHTemp
°C
Large envelope protein
(Hepatitis B virus)
BDBM289758
(US10093671, Example 27)
Show SMILES COc1cc-2c(CC(c3cccs3)n3cc(C(O)=O)c(=O)cc-23)cc1OCC(F)(F)F
Show InChI InChI=1S/C21H16F3NO5S/c1-29-17-7-12-11(6-18(17)30-10-21(22,23)24)5-15(19-3-2-4-31-19)25-9-13(20(27)28)16(26)8-14(12)25/h2-4,6-9,15H,5,10H2,1H3,(H,27,28)
US Patent
n/an/a 3n/an/an/an/an/a25
Hoffmann-La Roche Inc.
US Patent
Assay Description
HepG2.2.15 cells were seeded in duplicate into white, 96-well plates at 1.5×104 cells/well. The cells were treated with a three-fold serial dilution ...
US Patent US10093671 (2018)
BindingDB Entry DOI: 10.7270/Q21838KR