BDBM289767 US10093671, Example 36
SMILES: COc1cc-2c(CC(c3cccs3)n3cc(C(O)=O)c(=O)cc-23)cc1N1CCCC1
InChI Key: InChIKey=SYAHPIICNROLIH-UHFFFAOYSA-N
Data: 1 IC50
Activity Spreadsheet -- Enzyme Inhibition Constant Data from BindingDB
Found 1 hit for monomerid = 289767
Trg + Lig
Ki
nM
ΔG°
kcal/mole
IC50
nM
Kd
nM
EC50/IC50
nM
koff
s-1
kon
M-1s-1
pHTemp
°C
Large envelope protein
(Hepatitis B virus)
BDBM289767
(US10093671, Example 36)
Show SMILES COc1cc-2c(CC(c3cccs3)n3cc(C(O)=O)c(=O)cc-23)cc1N1CCCC1
Show InChI InChI=1S/C23H22N2O4S/c1-29-21-11-15-14(9-18(21)24-6-2-3-7-24)10-19(22-5-4-8-30-22)25-13-16(23(27)28)20(26)12-17(15)25/h4-5,8-9,11-13,19H,2-3,6-7,10H2,1H3,(H,27,28)
US Patent
n/an/a 3n/an/an/an/an/a25
Hoffmann-La Roche Inc.
US Patent
Assay Description
HepG2.2.15 cells were seeded in duplicate into white, 96-well plates at 1.5×104 cells/well. The cells were treated with a three-fold serial dilution ...
US Patent US10093671 (2018)
BindingDB Entry DOI: 10.7270/Q21838KR