BDBM289793 US10093683, Example 21a
SMILES: COC(=O)Nc1ccc(cc1)C(=O)N[C@@H](CC1CC1)C(=O)N1CC[C@]2(C1)OC(=O)Nc1ccc(Cl)cc21
InChI Key: InChIKey=JARFYEPFEKTRFV-HFZDXXHNSA-N
Data: 1 KI
Activity Spreadsheet -- Enzyme Inhibition Constant Data from BindingDB
Found 1 hit for monomerid = 289793
Trg + Lig
Ki
nM
ΔG°
kcal/mole
IC50
nM
Kd
nM
EC50/IC50
nM
koff
s-1
kon
M-1s-1
pHTemp
°C
Coagulation factor XI
(Homo sapiens (Human))
BDBM289793
(US10093683, Example 21a)
Show SMILES COC(=O)Nc1ccc(cc1)C(=O)N[C@@H](CC1CC1)C(=O)N1CC[C@]2(C1)OC(=O)Nc1ccc(Cl)cc21 |r|
Show InChI InChI=1S/C26H27ClN4O6/c1-36-24(34)28-18-7-4-16(5-8-18)22(32)29-21(12-15-2-3-15)23(33)31-11-10-26(14-31)19-13-17(27)6-9-20(19)30-25(35)37-26/h4-9,13,15,21H,2-3,10-12,14H2,1H3,(H,28,34)(H,29,32)(H,30,35)/t21-,26+/m0/s1
Reactome pathway
US Patent
726 -8.37n/an/an/an/an/a7.425
Merck Sharp & Dohme Corp.
US Patent
Assay Description
The effectiveness of a compound of the present invention as an inhibitor of Coagulation Factor XIa can be determined using a relevant purified serine...
US Patent US10093683 (2018)
BindingDB Entry DOI: 10.7270/Q2RR2197