null
SMILES: Clc1ccc2NC(=O)OC3(CCN(C3)C(=O)[C@H](Cc3ccccc3)NC(=O)c3ccc4NC(=O)CS(=O)c4c3)c2c1
InChI Key: InChIKey=LZPHWVQXYMPPDY-DPNGEBMGSA-N
Activity Spreadsheet -- Enzyme Inhibition Constant Data from BindingDB
Found 1 hit for monomerid = 289841
Trg + Lig
Ki
nM
ΔG°
kcal/mole
IC50
nM
Kd
nM
EC50/IC50
nM
koff
s-1
kon
M-1s-1
pHTemp
°C
Coagulation factor XI
(Homo sapiens (Human))
BDBM289841
(N-((2S)-1-(6-chloro-2-oxo-1,2-dihydrospiro[benzo[d...)
Show SMILES Clc1ccc2NC(=O)OC3(CCN(C3)C(=O)[C@H](Cc3ccccc3)NC(=O)c3ccc4NC(=O)CS(=O)c4c3)c2c1 |r|
Show InChI InChI=1S/C29H25ClN4O6S/c30-19-7-9-21-20(14-19)29(40-28(38)33-21)10-11-34(16-29)27(37)23(12-17-4-2-1-3-5-17)32-26(36)18-6-8-22-24(13-18)41(39)15-25(35)31-22/h1-9,13-14,23H,10-12,15-16H2,(H,31,35)(H,32,36)(H,33,38)/t23-,29?,41?/m0/s1
Reactome pathway
US Patent
99.7 -9.54n/an/an/an/an/a7.425
Merck Sharp & Dohme Corp.
US Patent
Assay Description
The effectiveness of a compound of the present invention as an inhibitor of Coagulation Factor XIa can be determined using a relevant purified serine...
US Patent US10093683 (2018)
BindingDB Entry DOI: 10.7270/Q2RR2197