null
SMILES: OP(O)(=O)COC(=O)Nc1ccc(cc1)C(=O)N[C@@H](Cc1cccc(F)c1)C(=O)N1CCC[C@@]2(C1)OC(=O)Nc1ccc(Cl)c(F)c21
InChI Key: InChIKey=QESRUHXQTGZADB-JHOBJCJYSA-N
Activity Spreadsheet -- Enzyme Inhibition Constant Data from BindingDB
Found 1 hit for monomerid = 289852
Trg + Lig
Ki
nM
ΔG°
kcal/mole
IC50
nM
Kd
nM
EC50/IC50
nM
koff
s-1
kon
M-1s-1
pHTemp
°C
Coagulation factor XI
(Homo sapiens (Human))
BDBM289852
((2-(4-(((S)-1-((R)-6-Chloro-5-fluoro-2-oxo-1,2-dih...)
Show SMILES OP(O)(=O)COC(=O)Nc1ccc(cc1)C(=O)N[C@@H](Cc1cccc(F)c1)C(=O)N1CCC[C@@]2(C1)OC(=O)Nc1ccc(Cl)c(F)c21 |r|
Show InChI InChI=1S/C30H28ClF2N4O9P/c31-21-9-10-22-24(25(21)33)30(46-29(41)36-22)11-2-12-37(15-30)27(39)23(14-17-3-1-4-19(32)13-17)35-26(38)18-5-7-20(8-6-18)34-28(40)45-16-47(42,43)44/h1,3-10,13,23H,2,11-12,14-16H2,(H,34,40)(H,35,38)(H,36,41)(H2,42,43,44)/t23-,30-/m0/s1
Reactome pathway
US Patent
367 -8.77n/an/an/an/an/a7.425
Merck Sharp & Dohme Corp.
US Patent
Assay Description
The effectiveness of a compound of the present invention as an inhibitor of Coagulation Factor XIa can be determined using a relevant purified serine...
US Patent US10093683 (2018)
BindingDB Entry DOI: 10.7270/Q2RR2197