null
SMILES: C=CC(=O)N1CCCC(C1)n1c2ccccc2[nH]c1=NC(=O)c1ccc(s1)-c1cn[nH]c1
InChI Key:
Activity Spreadsheet -- Enzyme Inhibition Constant Data from BindingDB
Found 1 hit for monomerid = 290222
Trg + Lig
Ki
nM
ΔG°
kcal/mole
IC50
nM
Kd
nM
EC50/IC50
nM
koff
s-1
kon
M-1s-1
pHTemp
°C
Tyrosine-protein kinase ITK/TSK
(Homo sapiens (Human))
BDBM290222
(US9573958, Compound 20)
Show SMILES C=CC(=O)N1CCCC(C1)n1c2ccccc2[nH]c1=NC(=O)c1ccc(s1)-c1cn[nH]c1 |w:19.22|
Reactome pathway
US Patent
n/an/a 0.600n/an/an/an/a7.5n/a
PRINCIPIA BIOPHARMA, INC.
US Patent
Assay Description
The ability of the compounds of the present disclosure to inhibit ITK was measured using the Caliper assay format, which is an electrophoretic separa...
US Patent US9573958 (2017)
BindingDB Entry DOI: 10.7270/Q2M047GW