null
SMILES: N[C@]1(CN(CCN2CCCC2)C[C@@H]1CCCB(O)O)C(O)=O
InChI Key: InChIKey=BLKNNJZMICXAFD-JSGCOSHPSA-N
Activity Spreadsheet -- Enzyme Inhibition Constant Data from BindingDB
Found 6 hits for monomerid = 290402
Trg + Lig
Ki
nM
ΔG°
kcal/mole
IC50
nM
Kd
nM
EC50/IC50
nM
koff
s-1
kon
M-1s-1
pHTemp
°C
Arginase-1
(Homo sapiens (Human))
BDBM290402
((3R,4S)-3-amino-4-(3-boronopropyl)-1-(2-(pyrrolidi...)
Show SMILES N[C@]1(CN(CCN2CCCC2)C[C@@H]1CCCB(O)O)C(O)=O |r|
Show InChI InChI=1S/C14H28BN3O4/c16-14(13(19)20)11-18(9-8-17-6-1-2-7-17)10-12(14)4-3-5-15(21)22/h12,21-22H,1-11,16H2,(H,19,20)/t12-,14-/m0/s1
NCI pathway
Reactome pathway
US Patent
n/an/a<250n/an/an/an/a7.425
Mars, Incorporated
US Patent
Assay Description
Inhibition of arginase I (ARG I) and arginase II (ARG II) by Formula I or Formula II compounds is followed spectrophotometrically at 530 nm. The comp...
US Patent US10098902 (2018)
BindingDB Entry DOI: 10.7270/Q2319XXK
Arginase-2, mitochondrial
(Homo sapiens (Human))
BDBM290402
((3R,4S)-3-amino-4-(3-boronopropyl)-1-(2-(pyrrolidi...)
Show SMILES N[C@]1(CN(CCN2CCCC2)C[C@@H]1CCCB(O)O)C(O)=O |r|
Show InChI InChI=1S/C14H28BN3O4/c16-14(13(19)20)11-18(9-8-17-6-1-2-7-17)10-12(14)4-3-5-15(21)22/h12,21-22H,1-11,16H2,(H,19,20)/t12-,14-/m0/s1
Reactome pathway
US Patent
n/an/a<250n/an/an/an/a7.425
Mars, Incorporated
US Patent
Assay Description
Inhibition of arginase I (ARG I) and arginase II (ARG II) by Formula I or Formula II compounds is followed spectrophotometrically at 530 nm. The comp...
US Patent US10098902 (2018)
BindingDB Entry DOI: 10.7270/Q2319XXK
Arginase-2, mitochondrial
(Homo sapiens (Human))
BDBM290402
((3R,4S)-3-amino-4-(3-boronopropyl)-1-(2-(pyrrolidi...)
Show SMILES N[C@]1(CN(CCN2CCCC2)C[C@@H]1CCCB(O)O)C(O)=O |r|
Show InChI InChI=1S/C14H28BN3O4/c16-14(13(19)20)11-18(9-8-17-6-1-2-7-17)10-12(14)4-3-5-15(21)22/h12,21-22H,1-11,16H2,(H,19,20)/t12-,14-/m0/s1
Reactome pathway
US Patent
n/an/a 125n/an/an/an/an/an/a
TBA
Citation and Details
BindingDB Entry DOI: 10.7270/Q289193N
Arginase-2, mitochondrial
(Homo sapiens (Human))
BDBM290402
((3R,4S)-3-amino-4-(3-boronopropyl)-1-(2-(pyrrolidi...)
Show SMILES N[C@]1(CN(CCN2CCCC2)C[C@@H]1CCCB(O)O)C(O)=O |r|
Show InChI InChI=1S/C14H28BN3O4/c16-14(13(19)20)11-18(9-8-17-6-1-2-7-17)10-12(14)4-3-5-15(21)22/h12,21-22H,1-11,16H2,(H,19,20)/t12-,14-/m0/s1
Reactome pathway
US Patent
n/an/a 1.00E+3n/an/an/an/an/an/a
Mars, Incorporated
US Patent
Assay Description
Inhibition of arginase I (ARG I) and arginase II (ARG II) by Formula I or Formula II compounds is followed spectrophotometrically at 530 nm. The comp...
US Patent US10603330 (2020)
BindingDB Entry DOI: 10.7270/Q2WD43K6
Arginase-1
(Homo sapiens (Human))
BDBM290402
((3R,4S)-3-amino-4-(3-boronopropyl)-1-(2-(pyrrolidi...)
Show SMILES N[C@]1(CN(CCN2CCCC2)C[C@@H]1CCCB(O)O)C(O)=O |r|
Show InChI InChI=1S/C14H28BN3O4/c16-14(13(19)20)11-18(9-8-17-6-1-2-7-17)10-12(14)4-3-5-15(21)22/h12,21-22H,1-11,16H2,(H,19,20)/t12-,14-/m0/s1
NCI pathway
Reactome pathway
US Patent
n/an/a 125n/an/an/an/an/an/a
TBA
Assay Description
Inhibition of arginase I (ARG I) and arginase II (ARG II) by Formula I or Formula II compounds is followed spectrophotometrically at 530 nm. The comp...
Citation and Details
BindingDB Entry DOI: 10.7270/Q289193N
Arginase-1
(Homo sapiens (Human))
BDBM290402
((3R,4S)-3-amino-4-(3-boronopropyl)-1-(2-(pyrrolidi...)
Show SMILES N[C@]1(CN(CCN2CCCC2)C[C@@H]1CCCB(O)O)C(O)=O |r|
Show InChI InChI=1S/C14H28BN3O4/c16-14(13(19)20)11-18(9-8-17-6-1-2-7-17)10-12(14)4-3-5-15(21)22/h12,21-22H,1-11,16H2,(H,19,20)/t12-,14-/m0/s1
NCI pathway
Reactome pathway
US Patent
n/an/a 1.00E+3n/an/an/an/an/an/a
Mars, Incorporated
US Patent
Assay Description
Inhibition of arginase I (ARG I) and arginase II (ARG II) by Formula I or Formula II compounds is followed spectrophotometrically at 530 nm. The comp...
US Patent US10603330 (2020)
BindingDB Entry DOI: 10.7270/Q2WD43K6