BDBM290997 2-((2R,3R)-2-amino-3-methoxylbutylamino)-4-(1-ethyl-1H-indol-4-ylamino)pyrimidine-5-carboxamide::US9579320, Example 442
SMILES: CCn1ccc2c(Nc3nc(NC[C@@H](N)[C@@H](C)OC)ncc3C(N)=O)cccc12
InChI Key: InChIKey=IZHJFRCOJIOIEK-IUODEOHRSA-N
Data: 1 IC50
Activity Spreadsheet -- Enzyme Inhibition Constant Data from BindingDB
Found 1 hit for monomerid = 290997
Trg + Lig
Ki
nM
ΔG°
kcal/mole
IC50
nM
Kd
nM
EC50/IC50
nM
koff
s-1
kon
M-1s-1
pHTemp
°C
Tyrosine-protein kinase SYK
(Homo sapiens (Human))
BDBM290997
(2-((2R,3R)-2-amino-3-methoxylbutylamino)-4-(1-ethy...)
Show SMILES CCn1ccc2c(Nc3nc(NC[C@@H](N)[C@@H](C)OC)ncc3C(N)=O)cccc12 |r|
Show InChI InChI=1S/C20H27N7O2/c1-4-27-9-8-13-16(6-5-7-17(13)27)25-19-14(18(22)28)10-23-20(26-19)24-11-15(21)12(2)29-3/h5-10,12,15H,4,11,21H2,1-3H3,(H2,22,28)(H2,23,24,25,26)/t12-,15-/m1/s1
NCI pathway
Reactome pathway
US Patent
n/an/a 5.5n/an/an/an/a7.525
Portola Pharmaceuticals, Inc.
US Patent
Assay Description
Potency of candidate molecules for inhibiting syk tyrosine phosphorylation activity is assessed by measuring the ability of a test compound to inhibi...
US Patent US9579320 (2017)
BindingDB Entry DOI: 10.7270/Q2K07692