BDBM291128 US9580396, Example 2t
SMILES: CN1C(=N)N[C@@]2(CCOc3ccc(NC(=O)c4ccc(F)cn4)cc23)CS1(=O)=O
InChI Key: InChIKey=NJQBTQFZSXKHBD-SFHVURJKSA-N
Data: 2 KI
Activity Spreadsheet -- Enzyme Inhibition Constant Data from BindingDB
Found 2 hits for monomerid = 291128
Trg + Lig
Ki
nM
ΔG°
kcal/mole
IC50
nM
Kd
nM
EC50/IC50
nM
koff
s-1
kon
M-1s-1
pHTemp
°C
Beta-secretase 2
(Homo sapiens (Human))
BDBM291128
(US9580396, Example 2t)
Show SMILES CN1C(=N)N[C@@]2(CCOc3ccc(NC(=O)c4ccc(F)cn4)cc23)CS1(=O)=O |r|
Show InChI InChI=1S/C18H18FN5O4S/c1-24-17(20)23-18(10-29(24,26)27)6-7-28-15-5-3-12(8-13(15)18)22-16(25)14-4-2-11(19)9-21-14/h2-5,8-9H,6-7,10H2,1H3,(H2,20,23)(H,22,25)/t18-/m0/s1
US Patent
31n/an/an/an/an/an/a5.0n/a
Merck Sharp & Dohme Corp.
US Patent
Assay Description
Inhibitor IC50s at purified human autoBACE-2 are determined in a time-resolved endpoint proteolysis assay that measures hydrolysis of the QSY7-EISEVN...
US Patent US9580396 (2017)
BindingDB Entry DOI: 10.7270/Q29K4D9S
Beta-secretase 1
(Homo sapiens (Human))
BDBM291128
(US9580396, Example 2t)
Show SMILES CN1C(=N)N[C@@]2(CCOc3ccc(NC(=O)c4ccc(F)cn4)cc23)CS1(=O)=O |r|
Show InChI InChI=1S/C18H18FN5O4S/c1-24-17(20)23-18(10-29(24,26)27)6-7-28-15-5-3-12(8-13(15)18)22-16(25)14-4-2-11(19)9-21-14/h2-5,8-9H,6-7,10H2,1H3,(H2,20,23)(H,22,25)/t18-/m0/s1
US Patent
205n/an/an/an/an/an/a5.0n/a
Merck Sharp & Dohme Corp.
US Patent
Assay Description
A homogeneous time-resolved FRET assay can be used to determine IC50 values for inhibitors of the soluble human BACE1 catalytic domain. This assay mo...
US Patent US9580396 (2017)
BindingDB Entry DOI: 10.7270/Q29K4D9S