null
SMILES: CN1C(=N)N[C@@]2(CCOc3ccc(NC(=O)c4ccc(OC(F)F)cn4)cc23)CS1(=O)=O
InChI Key: InChIKey=GNEDVTBZOIDBEW-IBGZPJMESA-N
Activity Spreadsheet -- Enzyme Inhibition Constant Data from BindingDB
Found 2 hits for monomerid = 291129
Trg + Lig
Ki
nM
ΔG°
kcal/mole
IC50
nM
Kd
nM
EC50/IC50
nM
koff
s-1
kon
M-1s-1
pHTemp
°C
Beta-secretase 1
(Homo sapiens (Human))
BDBM291129
(US9580396, Example 2u)
Show SMILES CN1C(=N)N[C@@]2(CCOc3ccc(NC(=O)c4ccc(OC(F)F)cn4)cc23)CS1(=O)=O |r|
Show InChI InChI=1S/C19H19F2N5O5S/c1-26-18(22)25-19(10-32(26,28)29)6-7-30-15-5-2-11(8-13(15)19)24-16(27)14-4-3-12(9-23-14)31-17(20)21/h2-5,8-9,17H,6-7,10H2,1H3,(H2,22,25)(H,24,27)/t19-/m0/s1
US Patent
44n/an/an/an/an/an/a5.0n/a
Merck Sharp & Dohme Corp.
US Patent
Assay Description
A homogeneous time-resolved FRET assay can be used to determine IC50 values for inhibitors of the soluble human BACE1 catalytic domain. This assay mo...
US Patent US9580396 (2017)
BindingDB Entry DOI: 10.7270/Q29K4D9S
Beta-secretase 2
(Homo sapiens (Human))
BDBM291129
(US9580396, Example 2u)
Show SMILES CN1C(=N)N[C@@]2(CCOc3ccc(NC(=O)c4ccc(OC(F)F)cn4)cc23)CS1(=O)=O |r|
Show InChI InChI=1S/C19H19F2N5O5S/c1-26-18(22)25-19(10-32(26,28)29)6-7-30-15-5-2-11(8-13(15)19)24-16(27)14-4-3-12(9-23-14)31-17(20)21/h2-5,8-9,17H,6-7,10H2,1H3,(H2,22,25)(H,24,27)/t19-/m0/s1
US Patent
166n/an/an/an/an/an/a5.0n/a
Merck Sharp & Dohme Corp.
US Patent
Assay Description
Inhibitor IC50s at purified human autoBACE-2 are determined in a time-resolved endpoint proteolysis assay that measures hydrolysis of the QSY7-EISEVN...
US Patent US9580396 (2017)
BindingDB Entry DOI: 10.7270/Q29K4D9S