null
SMILES: CN1C(=N)N[C@@]2(CCCc3ccc(NC(=O)c4ccc(F)cn4)cc23)CS1(=O)=O
InChI Key: InChIKey=HCNLZEXPDACZPO-IBGZPJMESA-N
Activity Spreadsheet -- Enzyme Inhibition Constant Data from BindingDB
Found 2 hits for monomerid = 291139
Trg + Lig
Ki
nM
ΔG°
kcal/mole
IC50
nM
Kd
nM
EC50/IC50
nM
koff
s-1
kon
M-1s-1
pHTemp
°C
Beta-secretase 2
(Homo sapiens (Human))
BDBM291139
(US9580396, Example 5b)
Show SMILES CN1C(=N)N[C@@]2(CCCc3ccc(NC(=O)c4ccc(F)cn4)cc23)CS1(=O)=O |r|
Show InChI InChI=1S/C19H20FN5O3S/c1-25-18(21)24-19(11-29(25,27)28)8-2-3-12-4-6-14(9-15(12)19)23-17(26)16-7-5-13(20)10-22-16/h4-7,9-10H,2-3,8,11H2,1H3,(H2,21,24)(H,23,26)/t19-/m0/s1
US Patent
28n/an/an/an/an/an/a5.0n/a
Merck Sharp & Dohme Corp.
US Patent
Assay Description
Inhibitor IC50s at purified human autoBACE-2 are determined in a time-resolved endpoint proteolysis assay that measures hydrolysis of the QSY7-EISEVN...
US Patent US9580396 (2017)
BindingDB Entry DOI: 10.7270/Q29K4D9S
Beta-secretase 1
(Homo sapiens (Human))
BDBM291139
(US9580396, Example 5b)
Show SMILES CN1C(=N)N[C@@]2(CCCc3ccc(NC(=O)c4ccc(F)cn4)cc23)CS1(=O)=O |r|
Show InChI InChI=1S/C19H20FN5O3S/c1-25-18(21)24-19(11-29(25,27)28)8-2-3-12-4-6-14(9-15(12)19)23-17(26)16-7-5-13(20)10-22-16/h4-7,9-10H,2-3,8,11H2,1H3,(H2,21,24)(H,23,26)/t19-/m0/s1
US Patent
192n/an/an/an/an/an/a5.0n/a
Merck Sharp & Dohme Corp.
US Patent
Assay Description
A homogeneous time-resolved FRET assay can be used to determine IC50 values for inhibitors of the soluble human BACE1 catalytic domain. This assay mo...
US Patent US9580396 (2017)
BindingDB Entry DOI: 10.7270/Q29K4D9S