BDBM291690 N-((5-Fluoro-2,3-dihydrobenzofuran-4-yl)methyl)-8-(6-methoxy-4-methylpyridin-3-yl)-[1,2,4]triazolo[4,3-c]pyrimidin-5-amine::US9580437, Example 5
SMILES: COc1cc(C)c(cn1)-c1cnc(NCc2c3CCOc3ccc2F)n2cnnc12
InChI Key: InChIKey=CLWFDFUVIUSTHL-UHFFFAOYSA-N
Data: 3 IC50
Activity Spreadsheet -- Enzyme Inhibition Constant Data from BindingDB
Found 6 hits for monomerid = 291690
Trg + Lig
Ki
nM
ΔG°
kcal/mole
IC50
nM
Kd
nM
EC50/IC50
nM
koff
s-1
kon
M-1s-1
pHTemp
°C
Polycomb Repressive Complex 2 (PRC2)
(Homo sapiens (Human))
BDBM291690
(N-((5-Fluoro-2,3-dihydrobenzofuran-4-yl)methyl)-8-...)
Show SMILES COc1cc(C)c(cn1)-c1cnc(NCc2c3CCOc3ccc2F)n2cnnc12
Show InChI InChI=1S/C21H19FN6O2/c1-12-7-19(29-2)23-8-14(12)16-10-25-21(28-11-26-27-20(16)28)24-9-15-13-5-6-30-18(13)4-3-17(15)22/h3-4,7-8,10-11H,5-6,9H2,1-2H3,(H,24,25)
US Patent
n/an/a 4.80n/an/an/an/a8.0n/a
Novartis AG
US Patent
Assay Description
To assess the compounds potency in the EED-H3K27Me3 competition binding assay, compounds were serially diluted 3-fold in DMSO to obtain a total of tw...
US Patent US9580437 (2017)
BindingDB Entry DOI: 10.7270/Q24T6MD7
Polycomb Repressive Complex 2 (PRC2)
(Homo sapiens (Human))
BDBM291690
(N-((5-Fluoro-2,3-dihydrobenzofuran-4-yl)methyl)-8-...)
Show SMILES COc1cc(C)c(cn1)-c1cnc(NCc2c3CCOc3ccc2F)n2cnnc12
Show InChI InChI=1S/C21H19FN6O2/c1-12-7-19(29-2)23-8-14(12)16-10-25-21(28-11-26-27-20(16)28)24-9-15-13-5-6-30-18(13)4-3-17(15)22/h3-4,7-8,10-11H,5-6,9H2,1-2H3,(H,24,25)
US Patent
n/an/a 9.70n/an/an/an/a8.0n/a
Novartis AG
US Patent
Assay Description
Representative compounds of the present disclosure were serially and separately diluted 3-fold in DMSO to obtain a total of eight or twelve concentra...
US Patent US9580437 (2017)
BindingDB Entry DOI: 10.7270/Q24T6MD7
Polycomb protein EED
(Homo sapiens (Human))
BDBM291690
(N-((5-Fluoro-2,3-dihydrobenzofuran-4-yl)methyl)-8-...)
Show SMILES COc1cc(C)c(cn1)-c1cnc(NCc2c3CCOc3ccc2F)n2cnnc12
Show InChI InChI=1S/C21H19FN6O2/c1-12-7-19(29-2)23-8-14(12)16-10-25-21(28-11-26-27-20(16)28)24-9-15-13-5-6-30-18(13)4-3-17(15)22/h3-4,7-8,10-11H,5-6,9H2,1-2H3,(H,24,25)
n/an/a 2.90n/an/an/an/an/an/a
TBA
Citation and Details
Polycomb protein EED
(Homo sapiens (Human))
BDBM291690
(N-((5-Fluoro-2,3-dihydrobenzofuran-4-yl)methyl)-8-...)
Show SMILES COc1cc(C)c(cn1)-c1cnc(NCc2c3CCOc3ccc2F)n2cnnc12
Show InChI InChI=1S/C21H19FN6O2/c1-12-7-19(29-2)23-8-14(12)16-10-25-21(28-11-26-27-20(16)28)24-9-15-13-5-6-30-18(13)4-3-17(15)22/h3-4,7-8,10-11H,5-6,9H2,1-2H3,(H,24,25)
n/an/a 4.80n/an/an/an/an/an/a
TBA
Citation and Details
Polycomb protein EED
(Homo sapiens (Human))
BDBM291690
(N-((5-Fluoro-2,3-dihydrobenzofuran-4-yl)methyl)-8-...)
Show SMILES COc1cc(C)c(cn1)-c1cnc(NCc2c3CCOc3ccc2F)n2cnnc12
Show InChI InChI=1S/C21H19FN6O2/c1-12-7-19(29-2)23-8-14(12)16-10-25-21(28-11-26-27-20(16)28)24-9-15-13-5-6-30-18(13)4-3-17(15)22/h3-4,7-8,10-11H,5-6,9H2,1-2H3,(H,24,25)
n/an/a 9.70n/an/an/an/an/an/a
TBA
Citation and Details
Polycomb Repressive Complex 2 (PRC2)
(Homo sapiens (Human))
BDBM291690
(N-((5-Fluoro-2,3-dihydrobenzofuran-4-yl)methyl)-8-...)
Show SMILES COc1cc(C)c(cn1)-c1cnc(NCc2c3CCOc3ccc2F)n2cnnc12
Show InChI InChI=1S/C21H19FN6O2/c1-12-7-19(29-2)23-8-14(12)16-10-25-21(28-11-26-27-20(16)28)24-9-15-13-5-6-30-18(13)4-3-17(15)22/h3-4,7-8,10-11H,5-6,9H2,1-2H3,(H,24,25)
US Patent
n/an/a 2.90n/an/an/an/an/an/a
Novartis AG
US Patent
Assay Description
Cell lysates were transferred to the wells of a 384-well plate and the final volume was adjusted to 50 μL per well with PBS. The plate was seale...
US Patent US9580437 (2017)
BindingDB Entry DOI: 10.7270/Q24T6MD7