BDBM291875 2-(4-(5-(((5-fluoro-2,3-dihydrobenzofuran-4-yl)methyl)amino)-[1,2,4]triazolo[4,3-c]pyrimidin-8-yl)-3-methyl-1H-pyrazol-1-yl)ethanol::US9580437, Example 190
SMILES: Cc1nn(CCO)cc1-c1cnc(NCc2c3CCOc3ccc2F)n2cnnc12
InChI Key: InChIKey=YJGGHCUWIOSYKC-UHFFFAOYSA-N
Data: 3 IC50
Activity Spreadsheet -- Enzyme Inhibition Constant Data from BindingDB
Found 6 hits for monomerid = 291875
Trg + Lig
Ki
nM
ΔG°
kcal/mole
IC50
nM
Kd
nM
EC50/IC50
nM
koff
s-1
kon
M-1s-1
pHTemp
°C
Polycomb Repressive Complex 2 (PRC2)
(Homo sapiens (Human))
BDBM291875
(2-(4-(5-(((5-fluoro-2,3-dihydrobenzofuran-4-yl)met...)
Show SMILES Cc1nn(CCO)cc1-c1cnc(NCc2c3CCOc3ccc2F)n2cnnc12
Show InChI InChI=1S/C20H20FN7O2/c1-12-16(10-27(26-12)5-6-29)15-9-23-20(28-11-24-25-19(15)28)22-8-14-13-4-7-30-18(13)3-2-17(14)21/h2-3,9-11,29H,4-8H2,1H3,(H,22,23)
US Patent
n/an/a 4.5n/an/an/an/a8.0n/a
Novartis AG
US Patent
Assay Description
To assess the compounds potency in the EED-H3K27Me3 competition binding assay, compounds were serially diluted 3-fold in DMSO to obtain a total of tw...
US Patent US9580437 (2017)
BindingDB Entry DOI: 10.7270/Q24T6MD7
Polycomb Repressive Complex 2 (PRC2)
(Homo sapiens (Human))
BDBM291875
(2-(4-(5-(((5-fluoro-2,3-dihydrobenzofuran-4-yl)met...)
Show SMILES Cc1nn(CCO)cc1-c1cnc(NCc2c3CCOc3ccc2F)n2cnnc12
Show InChI InChI=1S/C20H20FN7O2/c1-12-16(10-27(26-12)5-6-29)15-9-23-20(28-11-24-25-19(15)28)22-8-14-13-4-7-30-18(13)3-2-17(14)21/h2-3,9-11,29H,4-8H2,1H3,(H,22,23)
US Patent
n/an/a 17.1n/an/an/an/a8.0n/a
Novartis AG
US Patent
Assay Description
Representative compounds of the present disclosure were serially and separately diluted 3-fold in DMSO to obtain a total of eight or twelve concentra...
US Patent US9580437 (2017)
BindingDB Entry DOI: 10.7270/Q24T6MD7
Polycomb protein EED
(Homo sapiens (Human))
BDBM291875
(2-(4-(5-(((5-fluoro-2,3-dihydrobenzofuran-4-yl)met...)
Show SMILES Cc1nn(CCO)cc1-c1cnc(NCc2c3CCOc3ccc2F)n2cnnc12
Show InChI InChI=1S/C20H20FN7O2/c1-12-16(10-27(26-12)5-6-29)15-9-23-20(28-11-24-25-19(15)28)22-8-14-13-4-7-30-18(13)3-2-17(14)21/h2-3,9-11,29H,4-8H2,1H3,(H,22,23)
n/an/a 2.5n/an/an/an/an/an/a
TBA
Citation and Details
Polycomb protein EED
(Homo sapiens (Human))
BDBM291875
(2-(4-(5-(((5-fluoro-2,3-dihydrobenzofuran-4-yl)met...)
Show SMILES Cc1nn(CCO)cc1-c1cnc(NCc2c3CCOc3ccc2F)n2cnnc12
Show InChI InChI=1S/C20H20FN7O2/c1-12-16(10-27(26-12)5-6-29)15-9-23-20(28-11-24-25-19(15)28)22-8-14-13-4-7-30-18(13)3-2-17(14)21/h2-3,9-11,29H,4-8H2,1H3,(H,22,23)
n/an/a 4.5n/an/an/an/an/an/a
TBA
Citation and Details
Polycomb protein EED
(Homo sapiens (Human))
BDBM291875
(2-(4-(5-(((5-fluoro-2,3-dihydrobenzofuran-4-yl)met...)
Show SMILES Cc1nn(CCO)cc1-c1cnc(NCc2c3CCOc3ccc2F)n2cnnc12
Show InChI InChI=1S/C20H20FN7O2/c1-12-16(10-27(26-12)5-6-29)15-9-23-20(28-11-24-25-19(15)28)22-8-14-13-4-7-30-18(13)3-2-17(14)21/h2-3,9-11,29H,4-8H2,1H3,(H,22,23)
n/an/a 17.1n/an/an/an/an/an/a
TBA
Citation and Details
Polycomb Repressive Complex 2 (PRC2)
(Homo sapiens (Human))
BDBM291875
(2-(4-(5-(((5-fluoro-2,3-dihydrobenzofuran-4-yl)met...)
Show SMILES Cc1nn(CCO)cc1-c1cnc(NCc2c3CCOc3ccc2F)n2cnnc12
Show InChI InChI=1S/C20H20FN7O2/c1-12-16(10-27(26-12)5-6-29)15-9-23-20(28-11-24-25-19(15)28)22-8-14-13-4-7-30-18(13)3-2-17(14)21/h2-3,9-11,29H,4-8H2,1H3,(H,22,23)
US Patent
n/an/a 2.5n/an/an/an/an/an/a
Novartis AG
US Patent
Assay Description
Cell lysates were transferred to the wells of a 384-well plate and the final volume was adjusted to 50 μL per well with PBS. The plate was seale...
US Patent US9580437 (2017)
BindingDB Entry DOI: 10.7270/Q24T6MD7