BDBM292056 2-Cyclobutyl-3-(7-methyl-1H-indazol-5-yl)-5-(trifluoromethyl)-2H-pyrazolo[4,3-::US10100045, Example 27
SMILES: Cc1cc(cc2cn[nH]c12)-c1n(nc2ccc(nc12)C(F)(F)F)C1CCC1
InChI Key: InChIKey=MJGSMAILNAUYAT-UHFFFAOYSA-N
Data: 1 IC50
Activity Spreadsheet -- Enzyme Inhibition Constant Data from BindingDB
Found 1 hit for monomerid = 292056
Trg + Lig
Ki
nM
ΔG°
kcal/mole
IC50
nM
Kd
nM
EC50/IC50
nM
koff
s-1
kon
M-1s-1
pHTemp
°C
Voltage-dependent calcium channel gamma-2 subunit
(Homo sapiens (Human))
BDBM292056
(2-Cyclobutyl-3-(7-methyl-1H-indazol-5-yl)-5-(trifl...)
Show SMILES Cc1cc(cc2cn[nH]c12)-c1n(nc2ccc(nc12)C(F)(F)F)C1CCC1
Show InChI InChI=1S/C19H16F3N5/c1-10-7-11(8-12-9-23-25-16(10)12)18-17-14(26-27(18)13-3-2-4-13)5-6-15(24-17)19(20,21)22/h5-9,13H,2-4H2,1H3,(H,23,25)
US Patent
n/an/a 0.0200n/an/an/an/a7.4n/a
Janssen Pharmaceutica NV
US Patent
Assay Description
Cell expressing the GRIA1o-CACNG8 fusion construct were grown in a monolayer in 96- or 384-well microtiter plates. They were washed with assay buffer...
US Patent US10100045 (2018)
BindingDB Entry DOI: 10.7270/Q2MW2K56