BDBM292113 US10100049, Example 10::US10183942, Example 10::US10526330, Example 10::US10913740, Example 10
SMILES: CCC(C)N(C)CCN1CCc2[nH]c(nc2C1)-c1n[nH]c2cc(ccc12)-c1cc(F)c(O)cc1CC
InChI Key: InChIKey=XWRHGFBZLYQOEJ-BYYHNAKLSA-N
Data: 16 KI
Activity Spreadsheet -- Enzyme Inhibition Constant Data from BindingDB
Found 16 hits for monomerid = 292113
Trg + Lig
Ki
nM
ΔG°
kcal/mole
IC50
nM
Kd
nM
EC50/IC50
nM
koff
s-1
kon
M-1s-1
pHTemp
°C
Tyrosine-protein kinase JAK1
(Homo sapiens (Human))
BDBM292113
(US10100049, Example 10 | US10183942, Example 10 | ...)
Show SMILES CCC(C)N(C)CCN1CCc2[nH]c(nc2C1)-c1n[nH]c2cc(ccc12)-c1cc(F)c(O)cc1CC
Show InChI InChI=1S/C28H33FN6O/c1-5-17(3)34(4)11-12-35-10-9-23-25(16-35)31-28(30-23)27-20-8-7-19(13-24(20)32-33-27)21-15-22(29)26(36)14-18(21)6-2/h7-8,13-15,17,36H,5-6,9-12,16H2,1-4H3/b28-27+
Reactome pathway
US Patent
<0.100n/an/an/an/an/an/a7.5n/a
THERAVANCE BIOPHARMA R&D IP, LLC
US Patent
Assay Description
A panel of four LanthaScreen JAK biochemical assays (JAKL 2, 3 and Tyk2) were carried in a common kinase reaction buffer (50 mM HEPES, pH 7.5, 0.01% ...
US Patent US10100049 (2018)
BindingDB Entry DOI: 10.7270/Q27M09Z8
Tyrosine-protein kinase JAK2
(Homo sapiens (Human))
BDBM292113
(US10100049, Example 10 | US10183942, Example 10 | ...)
Show SMILES CCC(C)N(C)CCN1CCc2[nH]c(nc2C1)-c1n[nH]c2cc(ccc12)-c1cc(F)c(O)cc1CC
Show InChI InChI=1S/C28H33FN6O/c1-5-17(3)34(4)11-12-35-10-9-23-25(16-35)31-28(30-23)27-20-8-7-19(13-24(20)32-33-27)21-15-22(29)26(36)14-18(21)6-2/h7-8,13-15,17,36H,5-6,9-12,16H2,1-4H3/b28-27+
Reactome pathway
US Patent
<0.100n/an/an/an/an/an/an/an/a
Theravance Biopharma R&D IP, LLC
US Patent
Assay Description
A panel of four LanthaScreen JAK biochemical assays (JAK1, 2, 3 and Tyk2) were carried in a common kinase reaction buffer (50 mM HEPES, pH 7.5, 0.01%...
US Patent US10913740 (2021)
Tyrosine-protein kinase JAK1
(Homo sapiens (Human))
BDBM292113
(US10100049, Example 10 | US10183942, Example 10 | ...)
Show SMILES CCC(C)N(C)CCN1CCc2[nH]c(nc2C1)-c1n[nH]c2cc(ccc12)-c1cc(F)c(O)cc1CC
Show InChI InChI=1S/C28H33FN6O/c1-5-17(3)34(4)11-12-35-10-9-23-25(16-35)31-28(30-23)27-20-8-7-19(13-24(20)32-33-27)21-15-22(29)26(36)14-18(21)6-2/h7-8,13-15,17,36H,5-6,9-12,16H2,1-4H3/b28-27+
Reactome pathway
US Patent
<0.100n/an/an/an/an/an/an/an/a
Theravance Biopharma R&D IP, LLC
US Patent
Assay Description
A panel of four LanthaScreen JAK biochemical assays (JAK1, 2, 3 and Tyk2) were carried in a common kinase reaction buffer (50 mM HEPES, pH 7.5, 0.01%...
US Patent US10913740 (2021)
Tyrosine-protein kinase JAK2
(Homo sapiens (Human))
BDBM292113
(US10100049, Example 10 | US10183942, Example 10 | ...)
Show SMILES CCC(C)N(C)CCN1CCc2[nH]c(nc2C1)-c1n[nH]c2cc(ccc12)-c1cc(F)c(O)cc1CC
Show InChI InChI=1S/C28H33FN6O/c1-5-17(3)34(4)11-12-35-10-9-23-25(16-35)31-28(30-23)27-20-8-7-19(13-24(20)32-33-27)21-15-22(29)26(36)14-18(21)6-2/h7-8,13-15,17,36H,5-6,9-12,16H2,1-4H3/b28-27+
Reactome pathway
US Patent
<0.100n/an/an/an/an/an/an/an/a
THERAVANCE BIOPHARMA R&D IP, LLC
US Patent
US Patent US10183942 (2019)
BindingDB Entry DOI: 10.7270/Q2G44SC9
Tyrosine-protein kinase JAK1
(Homo sapiens (Human))
BDBM292113
(US10100049, Example 10 | US10183942, Example 10 | ...)
Show SMILES CCC(C)N(C)CCN1CCc2[nH]c(nc2C1)-c1n[nH]c2cc(ccc12)-c1cc(F)c(O)cc1CC
Show InChI InChI=1S/C28H33FN6O/c1-5-17(3)34(4)11-12-35-10-9-23-25(16-35)31-28(30-23)27-20-8-7-19(13-24(20)32-33-27)21-15-22(29)26(36)14-18(21)6-2/h7-8,13-15,17,36H,5-6,9-12,16H2,1-4H3/b28-27+
Reactome pathway
US Patent
<0.100n/an/an/an/an/an/an/an/a
THERAVANCE BIOPHARMA R&D IP, LLC
US Patent
Assay Description
A panel of four LanthaScreen JAK biochemical assays (JAK1, 2, 3 and Tyk2) were carried in a common kinase reaction buffer (50 mM HEPES, pH 7.5, 0.01%...
US Patent US10183942 (2019)
BindingDB Entry DOI: 10.7270/Q2G44SC9
Tyrosine-protein kinase JAK2
(Homo sapiens (Human))
BDBM292113
(US10100049, Example 10 | US10183942, Example 10 | ...)
Show SMILES CCC(C)N(C)CCN1CCc2[nH]c(nc2C1)-c1n[nH]c2cc(ccc12)-c1cc(F)c(O)cc1CC
Show InChI InChI=1S/C28H33FN6O/c1-5-17(3)34(4)11-12-35-10-9-23-25(16-35)31-28(30-23)27-20-8-7-19(13-24(20)32-33-27)21-15-22(29)26(36)14-18(21)6-2/h7-8,13-15,17,36H,5-6,9-12,16H2,1-4H3/b28-27+
Reactome pathway
US Patent
<0.100n/an/an/an/an/an/an/an/a
Theravance Biopharma R&D IP, LLC
US Patent
Assay Description
A panel of four LanthaScreen JAK biochemical assays (JAK1, 2, 3 and Tyk2) were carried in a common kinase reaction buffer (50 mM HEPES, pH 7.5, 0.01%...
US Patent US10526330 (2020)
BindingDB Entry DOI: 10.7270/Q2TF00RD
Tyrosine-protein kinase JAK1
(Homo sapiens (Human))
BDBM292113
(US10100049, Example 10 | US10183942, Example 10 | ...)
Show SMILES CCC(C)N(C)CCN1CCc2[nH]c(nc2C1)-c1n[nH]c2cc(ccc12)-c1cc(F)c(O)cc1CC
Show InChI InChI=1S/C28H33FN6O/c1-5-17(3)34(4)11-12-35-10-9-23-25(16-35)31-28(30-23)27-20-8-7-19(13-24(20)32-33-27)21-15-22(29)26(36)14-18(21)6-2/h7-8,13-15,17,36H,5-6,9-12,16H2,1-4H3/b28-27+
Reactome pathway
US Patent
<0.100n/an/an/an/an/an/an/an/a
Theravance Biopharma R&D IP, LLC
US Patent
Assay Description
A panel of four LanthaScreen JAK biochemical assays (JAK1, 2, 3 and Tyk2) were carried in a common kinase reaction buffer (50 mM HEPES, pH 7.5, 0.01%...
US Patent US10526330 (2020)
BindingDB Entry DOI: 10.7270/Q2TF00RD
Tyrosine-protein kinase JAK2
(Homo sapiens (Human))
BDBM292113
(US10100049, Example 10 | US10183942, Example 10 | ...)
Show SMILES CCC(C)N(C)CCN1CCc2[nH]c(nc2C1)-c1n[nH]c2cc(ccc12)-c1cc(F)c(O)cc1CC
Show InChI InChI=1S/C28H33FN6O/c1-5-17(3)34(4)11-12-35-10-9-23-25(16-35)31-28(30-23)27-20-8-7-19(13-24(20)32-33-27)21-15-22(29)26(36)14-18(21)6-2/h7-8,13-15,17,36H,5-6,9-12,16H2,1-4H3/b28-27+
Reactome pathway
US Patent
<0.100n/an/an/an/an/an/a7.5n/a
THERAVANCE BIOPHARMA R&D IP, LLC
US Patent
Assay Description
A panel of four LanthaScreen JAK biochemical assays (JAKL 2, 3 and Tyk2) were carried in a common kinase reaction buffer (50 mM HEPES, pH 7.5, 0.01% ...
US Patent US10100049 (2018)
BindingDB Entry DOI: 10.7270/Q27M09Z8
Tyrosine-protein kinase JAK3
(Homo sapiens (Human))
BDBM292113
(US10100049, Example 10 | US10183942, Example 10 | ...)
Show SMILES CCC(C)N(C)CCN1CCc2[nH]c(nc2C1)-c1n[nH]c2cc(ccc12)-c1cc(F)c(O)cc1CC
Show InChI InChI=1S/C28H33FN6O/c1-5-17(3)34(4)11-12-35-10-9-23-25(16-35)31-28(30-23)27-20-8-7-19(13-24(20)32-33-27)21-15-22(29)26(36)14-18(21)6-2/h7-8,13-15,17,36H,5-6,9-12,16H2,1-4H3/b28-27+
Reactome pathway
US Patent
0.550n/an/an/an/an/an/an/an/a
Theravance Biopharma R&D IP, LLC
US Patent
Assay Description
A panel of four LanthaScreen JAK biochemical assays (JAK1, 2, 3 and Tyk2) were carried in a common kinase reaction buffer (50 mM HEPES, pH 7.5, 0.01%...
US Patent US10913740 (2021)
Non-receptor tyrosine-protein kinase TYK2
(Homo sapiens (Human))
BDBM292113
(US10100049, Example 10 | US10183942, Example 10 | ...)
Show SMILES CCC(C)N(C)CCN1CCc2[nH]c(nc2C1)-c1n[nH]c2cc(ccc12)-c1cc(F)c(O)cc1CC
Show InChI InChI=1S/C28H33FN6O/c1-5-17(3)34(4)11-12-35-10-9-23-25(16-35)31-28(30-23)27-20-8-7-19(13-24(20)32-33-27)21-15-22(29)26(36)14-18(21)6-2/h7-8,13-15,17,36H,5-6,9-12,16H2,1-4H3/b28-27+
US Patent
0.550n/an/an/an/an/an/an/an/a
Theravance Biopharma R&D IP, LLC
US Patent
Assay Description
A panel of four LanthaScreen JAK biochemical assays (JAK1, 2, 3 and Tyk2) were carried in a common kinase reaction buffer (50 mM HEPES, pH 7.5, 0.01%...
US Patent US10526330 (2020)
BindingDB Entry DOI: 10.7270/Q2TF00RD
Tyrosine-protein kinase JAK3
(Homo sapiens (Human))
BDBM292113
(US10100049, Example 10 | US10183942, Example 10 | ...)
Show SMILES CCC(C)N(C)CCN1CCc2[nH]c(nc2C1)-c1n[nH]c2cc(ccc12)-c1cc(F)c(O)cc1CC
Show InChI InChI=1S/C28H33FN6O/c1-5-17(3)34(4)11-12-35-10-9-23-25(16-35)31-28(30-23)27-20-8-7-19(13-24(20)32-33-27)21-15-22(29)26(36)14-18(21)6-2/h7-8,13-15,17,36H,5-6,9-12,16H2,1-4H3/b28-27+
Reactome pathway
US Patent
0.550n/an/an/an/an/an/an/an/a
Theravance Biopharma R&D IP, LLC
US Patent
Assay Description
A panel of four LanthaScreen JAK biochemical assays (JAK1, 2, 3 and Tyk2) were carried in a common kinase reaction buffer (50 mM HEPES, pH 7.5, 0.01%...
US Patent US10526330 (2020)
BindingDB Entry DOI: 10.7270/Q2TF00RD
Non-receptor tyrosine-protein kinase TYK2
(Homo sapiens (Human))
BDBM292113
(US10100049, Example 10 | US10183942, Example 10 | ...)
Show SMILES CCC(C)N(C)CCN1CCc2[nH]c(nc2C1)-c1n[nH]c2cc(ccc12)-c1cc(F)c(O)cc1CC
Show InChI InChI=1S/C28H33FN6O/c1-5-17(3)34(4)11-12-35-10-9-23-25(16-35)31-28(30-23)27-20-8-7-19(13-24(20)32-33-27)21-15-22(29)26(36)14-18(21)6-2/h7-8,13-15,17,36H,5-6,9-12,16H2,1-4H3/b28-27+
US Patent
0.550n/an/an/an/an/an/an/an/a
Theravance Biopharma R&D IP, LLC
US Patent
Assay Description
A panel of four LanthaScreen JAK biochemical assays (JAK1, 2, 3 and Tyk2) were carried in a common kinase reaction buffer (50 mM HEPES, pH 7.5, 0.01%...
US Patent US10913740 (2021)
Tyrosine-protein kinase JAK3
(Homo sapiens (Human))
BDBM292113
(US10100049, Example 10 | US10183942, Example 10 | ...)
Show SMILES CCC(C)N(C)CCN1CCc2[nH]c(nc2C1)-c1n[nH]c2cc(ccc12)-c1cc(F)c(O)cc1CC
Show InChI InChI=1S/C28H33FN6O/c1-5-17(3)34(4)11-12-35-10-9-23-25(16-35)31-28(30-23)27-20-8-7-19(13-24(20)32-33-27)21-15-22(29)26(36)14-18(21)6-2/h7-8,13-15,17,36H,5-6,9-12,16H2,1-4H3/b28-27+
Reactome pathway
US Patent
0.550n/an/an/an/an/an/an/an/a
THERAVANCE BIOPHARMA R&D IP, LLC
US Patent
US Patent US10183942 (2019)
BindingDB Entry DOI: 10.7270/Q2G44SC9
Non-receptor tyrosine-protein kinase TYK2
(Homo sapiens (Human))
BDBM292113
(US10100049, Example 10 | US10183942, Example 10 | ...)
Show SMILES CCC(C)N(C)CCN1CCc2[nH]c(nc2C1)-c1n[nH]c2cc(ccc12)-c1cc(F)c(O)cc1CC
Show InChI InChI=1S/C28H33FN6O/c1-5-17(3)34(4)11-12-35-10-9-23-25(16-35)31-28(30-23)27-20-8-7-19(13-24(20)32-33-27)21-15-22(29)26(36)14-18(21)6-2/h7-8,13-15,17,36H,5-6,9-12,16H2,1-4H3/b28-27+
US Patent
0.550n/an/an/an/an/an/a7.5n/a
THERAVANCE BIOPHARMA R&D IP, LLC
US Patent
Assay Description
A panel of four LanthaScreen JAK biochemical assays (JAKL 2, 3 and Tyk2) were carried in a common kinase reaction buffer (50 mM HEPES, pH 7.5, 0.01% ...
US Patent US10100049 (2018)
BindingDB Entry DOI: 10.7270/Q27M09Z8
Tyrosine-protein kinase JAK3
(Homo sapiens (Human))
BDBM292113
(US10100049, Example 10 | US10183942, Example 10 | ...)
Show SMILES CCC(C)N(C)CCN1CCc2[nH]c(nc2C1)-c1n[nH]c2cc(ccc12)-c1cc(F)c(O)cc1CC
Show InChI InChI=1S/C28H33FN6O/c1-5-17(3)34(4)11-12-35-10-9-23-25(16-35)31-28(30-23)27-20-8-7-19(13-24(20)32-33-27)21-15-22(29)26(36)14-18(21)6-2/h7-8,13-15,17,36H,5-6,9-12,16H2,1-4H3/b28-27+
Reactome pathway
US Patent
0.550n/an/an/an/an/an/a7.5n/a
THERAVANCE BIOPHARMA R&D IP, LLC
US Patent
Assay Description
A panel of four LanthaScreen JAK biochemical assays (JAKL 2, 3 and Tyk2) were carried in a common kinase reaction buffer (50 mM HEPES, pH 7.5, 0.01% ...
US Patent US10100049 (2018)
BindingDB Entry DOI: 10.7270/Q27M09Z8
Non-receptor tyrosine-protein kinase TYK2
(Homo sapiens (Human))
BDBM292113
(US10100049, Example 10 | US10183942, Example 10 | ...)
Show SMILES CCC(C)N(C)CCN1CCc2[nH]c(nc2C1)-c1n[nH]c2cc(ccc12)-c1cc(F)c(O)cc1CC
Show InChI InChI=1S/C28H33FN6O/c1-5-17(3)34(4)11-12-35-10-9-23-25(16-35)31-28(30-23)27-20-8-7-19(13-24(20)32-33-27)21-15-22(29)26(36)14-18(21)6-2/h7-8,13-15,17,36H,5-6,9-12,16H2,1-4H3/b28-27+
US Patent
0.550n/an/an/an/an/an/an/an/a
THERAVANCE BIOPHARMA R&D IP, LLC
US Patent
US Patent US10183942 (2019)
BindingDB Entry DOI: 10.7270/Q2G44SC9