null
SMILES: [O-][N+](=O)c1cnc(Sc2nnc(NC(=O)c3ccc(F)cc3)s2)s1
InChI Key: InChIKey=ZJEVWLAYMWZYNB-UHFFFAOYSA-N
Activity Spreadsheet -- Enzyme Inhibition Constant Data from BindingDB
Found 2 hits for monomerid = 29316
Trg + Lig
Ki
nM
ΔG°
kcal/mole
IC50
nM
Kd
nM
EC50/IC50
nM
koff
s-1
kon
M-1s-1
pHTemp
°C
Mitogen-activated protein kinase 8
(Homo sapiens (Human))
BDBM29316
(2-amino-1,3,4-thiadiazole, 10)
Show SMILES [O-][N+](=O)c1cnc(Sc2nnc(NC(=O)c3ccc(F)cc3)s2)s1
Show InChI InChI=1S/C12H6FN5O3S3/c13-7-3-1-6(2-4-7)9(19)15-10-16-17-12(23-10)24-11-14-5-8(22-11)18(20)21/h1-5H,(H,15,16,19)
NCI pathway
Reactome pathway
n/an/a 8.40E+4n/an/an/an/an/an/a
Burnham Institute for Medical Research
Assay Description
Compounds were tested for their ability to inhibit JNK1 phosphorylation of ATF2 in the Time-Resolved Fluorescence Resonance Energy Transfer (TR-FRET)...
J Med Chem 52: 1943-52 (2009)
Article DOI: 10.1021/jm801503n
BindingDB Entry DOI: 10.7270/Q20Z71MD
Mitogen-activated protein kinase 8
(Homo sapiens (Human))
BDBM29316
(2-amino-1,3,4-thiadiazole, 10)
Show SMILES [O-][N+](=O)c1cnc(Sc2nnc(NC(=O)c3ccc(F)cc3)s2)s1
Show InChI InChI=1S/C12H6FN5O3S3/c13-7-3-1-6(2-4-7)9(19)15-10-16-17-12(23-10)24-11-14-5-8(22-11)18(20)21/h1-5H,(H,15,16,19)
NCI pathway
Reactome pathway
n/an/an/an/an/an/an/an/an/a
Burnham Institute for Medical Research
Assay Description
Compound was evaluated for its ability to disrupt the interaction of pepJIP1 with JNK1 by using DELFIA assay. DELFIA is a heterogeneous assay whereby...
J Med Chem 52: 1943-52 (2009)
Article DOI: 10.1021/jm801503n
BindingDB Entry DOI: 10.7270/Q20Z71MD