null
SMILES: COc1ccc(COc2ccc(cc2)-c2c(C)nc(C)c([C@H](OC(C)(C)C)C(O)=O)c2-c2ccc(Cl)cc2)cc1
InChI Key: InChIKey=SGSLAFFDDGTOLC-HKBQPEDESA-N
Activity Spreadsheet -- Enzyme Inhibition Constant Data from BindingDB
Found 2 hits for monomerid = 293265
Trg + Lig
Ki
nM
ΔG°
kcal/mole
IC50
nM
Kd
nM
EC50/IC50
nM
koff
s-1
kon
M-1s-1
pHTemp
°C
Gag-Pol polyprotein [489-587,Q496K]
(Human immunodeficiency virus type 1)
BDBM293265
(US10106504, Example 2)
Show SMILES COc1ccc(COc2ccc(cc2)-c2c(C)nc(C)c([C@H](OC(C)(C)C)C(O)=O)c2-c2ccc(Cl)cc2)cc1 |r|
Show InChI InChI=1S/C33H34ClNO5/c1-20-28(23-11-17-27(18-12-23)39-19-22-7-15-26(38-6)16-8-22)30(24-9-13-25(34)14-10-24)29(21(2)35-20)31(32(36)37)40-33(3,4)5/h7-18,31H,19H2,1-6H3,(H,36,37)/t31-/m0/s1
US Patent
n/an/an/an/a 73n/an/a7.55n/a
ViiV HEALTHCARE UK (NO.5) LIMITED
US Patent
Assay Description
A recombinant NL-RLuc proviral clone was constructed in which a section of the nef gene from NL4-3 was replaced with the Renilla Luciferase gene. Thi...
US Patent US10106504 (2018)
BindingDB Entry DOI: 10.7270/Q2BC41K2
Gag-Pol polyprotein [489-587,Q496K]
(Human immunodeficiency virus type 1)
BDBM293265
(US10106504, Example 2)
Show SMILES COc1ccc(COc2ccc(cc2)-c2c(C)nc(C)c([C@H](OC(C)(C)C)C(O)=O)c2-c2ccc(Cl)cc2)cc1 |r|
Show InChI InChI=1S/C33H34ClNO5/c1-20-28(23-11-17-27(18-12-23)39-19-22-7-15-26(38-6)16-8-22)30(24-9-13-25(34)14-10-24)29(21(2)35-20)31(32(36)37)40-33(3,4)5/h7-18,31H,19H2,1-6H3,(H,36,37)/t31-/m0/s1
US Patent
n/an/an/an/a<100n/an/a7.55n/a
ViiV HEALTHCARE UK (NO.5) LIMITED
US Patent
Assay Description
A recombinant NL-RLuc proviral clone was constructed in which a section of the nef gene from NL4-3 was replaced with the Renilla Luciferase gene. Thi...
US Patent US10106504 (2018)
BindingDB Entry DOI: 10.7270/Q2BC41K2