null
SMILES: [H][C@]12CN(C(N)=O)C(=Nc3ccc(C#N)c(Cl)c3C)N1CC[C@H]2O
InChI Key: InChIKey=HTRWURBNWYFPJF-VXGBXAGGSA-N
Activity Spreadsheet -- Enzyme Inhibition Constant Data from BindingDB
Found 1 hit for monomerid = 29327
Trg + Lig
Ki
nM
ΔG°
kcal/mole
IC50
nM
Kd
nM
EC50/IC50
nM
koff
s-1
kon
M-1s-1
pHTemp
°C
Androgen receptor
(Homo sapiens (Human))
BDBM29327
(guanidine derivative, 13)
Show SMILES [H][C@]12CN(C(N)=O)C(=Nc3ccc(C#N)c(Cl)c3C)N1CC[C@H]2O |r,w:8.8|
Show InChI InChI=1S/C15H16ClN5O2/c1-8-10(3-2-9(6-17)13(8)16)19-15-20-5-4-12(22)11(20)7-21(15)14(18)23/h2-3,11-12,22H,4-5,7H2,1H3,(H2,18,23)/t11-,12-/m1/s1
NCI pathway
Reactome pathway
19 -10.4n/an/an/an/an/a7.622
Bristol-Myers Squibb Company
Assay Description
Binding assays were conducted by incubating test compound at various concentrations with [3H]DHT with human cancer epithelial breast cell lines MDAMB...
J Med Chem 52: 2794-8 (2009)
Article DOI: 10.1021/jm801583j
BindingDB Entry DOI: 10.7270/Q2W66J30