BDBM293275 US10106504, Example 12
SMILES: COCCNCc1nc(C)c([C@H](OC(C)(C)C)C(O)=O)c(-c2ccc3OCCCc3c2)c1-c1ccc(OCCc2ccc(F)cc2)cc1
InChI Key: InChIKey=VLSPYMFCXQSEML-QNGWXLTQSA-N
Data: 2 EC50
Activity Spreadsheet -- Enzyme Inhibition Constant Data from BindingDB
Found 2 hits for monomerid = 293275
Trg + Lig
Ki
nM
ΔG°
kcal/mole
IC50
nM
Kd
nM
EC50/IC50
nM
koff
s-1
kon
M-1s-1
pHTemp
°C
HIV-1 Protease Chain A
(Human immunodeficiency virus type 1)
BDBM293275
(US10106504, Example 12)
Show SMILES COCCNCc1nc(C)c([C@H](OC(C)(C)C)C(O)=O)c(-c2ccc3OCCCc3c2)c1-c1ccc(OCCc2ccc(F)cc2)cc1 |r|
Show InChI InChI=1S/C39H45FN2O6/c1-25-34(37(38(43)44)48-39(2,3)4)36(29-12-17-33-28(23-29)7-6-20-47-33)35(32(42-25)24-41-19-22-45-5)27-10-15-31(16-11-27)46-21-18-26-8-13-30(40)14-9-26/h8-17,23,37,41H,6-7,18-22,24H2,1-5H3,(H,43,44)/t37-/m0/s1
US Patent
n/an/an/an/a 7n/an/a7.55n/a
ViiV HEALTHCARE UK (NO.5) LIMITED
US Patent
Assay Description
A recombinant NL-RLuc proviral clone was constructed in which a section of the nef gene from NL4-3 was replaced with the Renilla Luciferase gene. Thi...
US Patent US10106504 (2018)
BindingDB Entry DOI: 10.7270/Q2BC41K2
HIV-1 Protease Chain A
(Human immunodeficiency virus type 1)
BDBM293275
(US10106504, Example 12)
Show SMILES COCCNCc1nc(C)c([C@H](OC(C)(C)C)C(O)=O)c(-c2ccc3OCCCc3c2)c1-c1ccc(OCCc2ccc(F)cc2)cc1 |r|
Show InChI InChI=1S/C39H45FN2O6/c1-25-34(37(38(43)44)48-39(2,3)4)36(29-12-17-33-28(23-29)7-6-20-47-33)35(32(42-25)24-41-19-22-45-5)27-10-15-31(16-11-27)46-21-18-26-8-13-30(40)14-9-26/h8-17,23,37,41H,6-7,18-22,24H2,1-5H3,(H,43,44)/t37-/m0/s1
US Patent
n/an/an/an/a<100n/an/a7.55n/a
ViiV HEALTHCARE UK (NO.5) LIMITED
US Patent
Assay Description
A recombinant NL-RLuc proviral clone was constructed in which a section of the nef gene from NL4-3 was replaced with the Renilla Luciferase gene. Thi...
US Patent US10106504 (2018)
BindingDB Entry DOI: 10.7270/Q2BC41K2