BDBM29362 proline scaffold, 11
SMILES: COCCNC(=O)[C@@H]1CCCN1C(=O)CC1CCCCC1
InChI Key: InChIKey=GMNCFNYHRZKMLP-AWEZNQCLSA-N
Data: 1 IC50  1 Kd
Activity Spreadsheet -- Enzyme Inhibition Constant Data from BindingDB
Found 1 hit for monomerid = 29362
Trg + Lig
Ki
nM
ΔG°
kcal/mole
IC50
nM
Kd
nM
EC50/IC50
nM
koff
s-1
kon
M-1s-1
pHTemp
°C
Prothrombin
(Homo sapiens (Human))
BDBM29362
(proline scaffold, 11)
Show SMILES COCCNC(=O)[C@@H]1CCCN1C(=O)CC1CCCCC1 |r|
Show InChI InChI=1S/C16H28N2O3/c1-21-11-9-17-16(20)14-8-5-10-18(14)15(19)12-13-6-3-2-4-7-13/h13-14H,2-12H2,1H3,(H,17,20)/t14-/m0/s1
n/an/a>4.00E+5>1.00E+6n/an/an/a7.437
University of Kalmar
Assay Description
SPR experiments where performed with a Biacore A100 using Series S sensor chip CM5 (GE Healthcare Bio-Sciences AB, Uppsala, Sweden). The proteins wer...
J Med Chem 52: 2708-15 (2009)
Article DOI: 10.1021/jm8011849
BindingDB Entry DOI: 10.7270/Q2H130B7