BDBM293693 3-({[(4R)-7-cyclohexyl-3,4-dihydro-2H-1-benzopyran-4-::US10106534, Example 35
SMILES: OC(=O)c1ccncc1NCC1CCOc2cc(ccc12)C1CCCCC1
InChI Key: InChIKey=HITMFJYRCJRYLF-UHFFFAOYSA-N
Data: 1 IC50
Activity Spreadsheet -- Enzyme Inhibition Constant Data from BindingDB
Found 1 hit for monomerid = 293693
Trg + Lig
Ki
nM
ΔG°
kcal/mole
IC50
nM
Kd
nM
EC50/IC50
nM
koff
s-1
kon
M-1s-1
pHTemp
°C
Lysine-specific demethylase 4C
(Homo sapiens (Human))
BDBM293693
(3-({[(4R)-7-cyclohexyl-3,4-dihydro-2H-1-benzopyran...)
Show SMILES OC(=O)c1ccncc1NCC1CCOc2cc(ccc12)C1CCCCC1
Show InChI InChI=1S/C22H26N2O3/c25-22(26)19-8-10-23-14-20(19)24-13-17-9-11-27-21-12-16(6-7-18(17)21)15-4-2-1-3-5-15/h6-8,10,12,14-15,17,24H,1-5,9,11,13H2,(H,25,26)
US Patent
n/an/a 550n/an/an/an/an/a25
Celgene Quanticel Research, Inc.
US Patent
Assay Description
The ability of test compounds to inhibit the activity of JMJD2C was determined in 384-well plate format under the following reaction conditions: 0.3 ...
US Patent US10106534 (2018)
BindingDB Entry DOI: 10.7270/Q2JW8GZX