null
SMILES: CN(c1c(C)noc1C)c1ccc2[C@H](CNc3cnccc3C(O)=O)CCCc2c1
InChI Key: InChIKey=OJZIYBMAYLHTHU-KRWDZBQOSA-N
Activity Spreadsheet -- Enzyme Inhibition Constant Data from BindingDB
Found 2 hits for monomerid = 293824
Trg + Lig
Ki
nM
ΔG°
kcal/mole
IC50
nM
Kd
nM
EC50/IC50
nM
koff
s-1
kon
M-1s-1
pHTemp
°C
Lysine-specific demethylase 6B
(Homo sapiens (Human))
BDBM293824
(3-({[(1R)-6-[(dimethyl-1,2-oxazol-4-yl)(methyl)ami...)
Show SMILES CN(c1c(C)noc1C)c1ccc2[C@H](CNc3cnccc3C(O)=O)CCCc2c1 |r|
Show InChI InChI=1S/C23H26N4O3/c1-14-22(15(2)30-26-14)27(3)18-7-8-19-16(11-18)5-4-6-17(19)12-25-21-13-24-10-9-20(21)23(28)29/h7-11,13,17,25H,4-6,12H2,1-3H3,(H,28,29)/t17-/m0/s1
US Patent
n/an/a 5.50E+3n/an/an/an/an/a25
Celgene Quanticel Research, Inc.
US Patent
Assay Description
The enzymatic assay of JMJD3 activity is based upon Time Resolved-Fluorescence Resonance Energy Transfer (TR-FRET) detection. The ability of test com...
US Patent US10106534 (2018)
BindingDB Entry DOI: 10.7270/Q2JW8GZX
Lysine-specific demethylase 4C
(Homo sapiens (Human))
BDBM293824
(3-({[(1R)-6-[(dimethyl-1,2-oxazol-4-yl)(methyl)ami...)
Show SMILES CN(c1c(C)noc1C)c1ccc2[C@H](CNc3cnccc3C(O)=O)CCCc2c1 |r|
Show InChI InChI=1S/C23H26N4O3/c1-14-22(15(2)30-26-14)27(3)18-7-8-19-16(11-18)5-4-6-17(19)12-25-21-13-24-10-9-20(21)23(28)29/h7-11,13,17,25H,4-6,12H2,1-3H3,(H,28,29)/t17-/m0/s1
US Patent
n/an/a 550n/an/an/an/an/a25
Celgene Quanticel Research, Inc.
US Patent
Assay Description
The ability of test compounds to inhibit the activity of JMJD2C was determined in 384-well plate format under the following reaction conditions: 0.3 ...
US Patent US10106534 (2018)
BindingDB Entry DOI: 10.7270/Q2JW8GZX