BDBM293852 3-({[(4R)-7-{[4-(1H-imidazol-1-yl)phenyl](methyl)amino}-3,4-::US10106534, Example 194
SMILES: CN(c1ccc(cc1)-n1ccnc1)c1ccc2[C@H](CNc3cnccc3C(O)=O)CCOc2c1
InChI Key: InChIKey=KTXGMOXSLDDONE-SFHVURJKSA-N
Data: 2 IC50
Activity Spreadsheet -- Enzyme Inhibition Constant Data from BindingDB
Found 2 hits for monomerid = 293852
Trg + Lig
Ki
nM
ΔG°
kcal/mole
IC50
nM
Kd
nM
EC50/IC50
nM
koff
s-1
kon
M-1s-1
pHTemp
°C
jmjd3
(Homo sapiens (Human))
BDBM293852
(3-({[(4R)-7-{[4-(1H-imidazol-1-yl)phenyl](methyl)a...)
Show SMILES CN(c1ccc(cc1)-n1ccnc1)c1ccc2[C@H](CNc3cnccc3C(O)=O)CCOc2c1 |r|
Show InChI InChI=1S/C26H25N5O3/c1-30(19-2-4-20(5-3-19)31-12-11-28-17-31)21-6-7-22-18(9-13-34-25(22)14-21)15-29-24-16-27-10-8-23(24)26(32)33/h2-8,10-12,14,16-18,29H,9,13,15H2,1H3,(H,32,33)/t18-/m0/s1
US Patent
n/an/a 5.50E+3n/an/an/an/an/a25
Celgene Quanticel Research, Inc.
US Patent
Assay Description
The enzymatic assay of JMJD3 activity is based upon Time Resolved-Fluorescence Resonance Energy Transfer (TR-FRET) detection. The ability of test com...
US Patent US10106534 (2018)
BindingDB Entry DOI: 10.7270/Q2JW8GZX
Lysine-specific demethylase 4C
(Homo sapiens (Human))
BDBM293852
(3-({[(4R)-7-{[4-(1H-imidazol-1-yl)phenyl](methyl)a...)
Show SMILES CN(c1ccc(cc1)-n1ccnc1)c1ccc2[C@H](CNc3cnccc3C(O)=O)CCOc2c1 |r|
Show InChI InChI=1S/C26H25N5O3/c1-30(19-2-4-20(5-3-19)31-12-11-28-17-31)21-6-7-22-18(9-13-34-25(22)14-21)15-29-24-16-27-10-8-23(24)26(32)33/h2-8,10-12,14,16-18,29H,9,13,15H2,1H3,(H,32,33)/t18-/m0/s1
US Patent
n/an/a 550n/an/an/an/an/a25
Celgene Quanticel Research, Inc.
US Patent
Assay Description
The ability of test compounds to inhibit the activity of JMJD2C was determined in 384-well plate format under the following reaction conditions: 0.3 ...
US Patent US10106534 (2018)
BindingDB Entry DOI: 10.7270/Q2JW8GZX