null
SMILES: CC1(C)CCc2c1nc1sc(C(N)=O)c(N)c1c2-c1cncs1
InChI Key: InChIKey=LCNCIEOBBFVGLH-UHFFFAOYSA-N
Activity Spreadsheet -- Enzyme Inhibition Constant Data from BindingDB
Found 1 hit for monomerid = 293953
Trg + Lig
Ki
nM
ΔG°
kcal/mole
IC50
nM
Kd
nM
EC50/IC50
nM
koff
s-1
kon
M-1s-1
pHTemp
°C
Eukaryotic elongation factor 2 kinase
(Homo sapiens (Human))
BDBM293953
(US10106552, Compound 28)
Show SMILES CC1(C)CCc2c1nc1sc(C(N)=O)c(N)c1c2-c1cncs1
Show InChI InChI=1S/C16H16N4OS2/c1-16(2)4-3-7-9(8-5-19-6-22-8)10-11(17)12(14(18)21)23-15(10)20-13(7)16/h5-6H,3-4,17H2,1-2H3,(H2,18,21)
Reactome pathway
US Patent
n/an/a 400n/an/an/an/an/an/a
Longevica Pharmaceuticals, Inc.
US Patent
Assay Description
To determine the IC50 of compounds of the invention, recombinant eEF2K was diluted in an assay buffer in the presence of calmodulin, a calcium-bindin...
US Patent US10106552 (2018)
BindingDB Entry DOI: 10.7270/Q25M67SV