BDBM293962 US10106552, Compound 37
SMILES: CC1(C)CCCc2c1nc1sc(C(N)=O)c(N)c1c2-c1cc(Br)co1
InChI Key: InChIKey=NXKBDSIUOGFBMY-UHFFFAOYSA-N
Data: 1 IC50
Activity Spreadsheet -- Enzyme Inhibition Constant Data from BindingDB
Found 1 hit for monomerid = 293962
Trg + Lig
Ki
nM
ΔG°
kcal/mole
IC50
nM
Kd
nM
EC50/IC50
nM
koff
s-1
kon
M-1s-1
pHTemp
°C
Eukaryotic elongation factor 2 kinase
(Homo sapiens (Human))
BDBM293962
(US10106552, Compound 37)
Show SMILES CC1(C)CCCc2c1nc1sc(C(N)=O)c(N)c1c2-c1cc(Br)co1
Show InChI InChI=1S/C18H18BrN3O2S/c1-18(2)5-3-4-9-11(10-6-8(19)7-24-10)12-13(20)14(16(21)23)25-17(12)22-15(9)18/h6-7H,3-5,20H2,1-2H3,(H2,21,23)
Reactome pathway
US Patent
n/an/a 900n/an/an/an/an/an/a
Longevica Pharmaceuticals, Inc.
US Patent
Assay Description
To determine the IC50 of compounds of the invention, recombinant eEF2K was diluted in an assay buffer in the presence of calmodulin, a calcium-bindin...
US Patent US10106552 (2018)
BindingDB Entry DOI: 10.7270/Q25M67SV