null
SMILES: CN1CCN(CC1)c1nc2ncc(I)cc2n2cnnc12
InChI Key: InChIKey=KJARIWMPADKIOR-UHFFFAOYSA-N
Activity Spreadsheet -- Enzyme Inhibition Constant Data from BindingDB
Found 4 hits for monomerid = 294386
Trg + Lig
Ki
nM
ΔG°
kcal/mole
IC50
nM
Kd
nM
EC50/IC50
nM
koff
s-1
kon
M-1s-1
pHTemp
°C
Histamine H4 receptor
(Homo sapiens (Human))
BDBM294386
(US9586959, Compound 49)
Show SMILES CN1CCN(CC1)c1nc2ncc(I)cc2n2cnnc12
Show InChI InChI=1S/C13H14IN7/c1-19-2-4-20(5-3-19)12-13-18-16-8-21(13)10-6-9(14)7-15-11(10)17-12/h6-8H,2-5H2,1H3
Reactome pathway
US Patent
n/an/a 34n/an/an/an/a7.525
C&C RESEARCH LABORATORIES
US Patent
Assay Description
In vitro profiling protein kinases was performed using the HotSpot assay platform. Briefly, specific kinase/substrate pairs along with required cofac...
US Patent US9586959 (2017)
BindingDB Entry DOI: 10.7270/Q2C53NWD
Histamine H3 receptor
(Homo sapiens (Human))
BDBM294386
(US9586959, Compound 49)
Show SMILES CN1CCN(CC1)c1nc2ncc(I)cc2n2cnnc12
Show InChI InChI=1S/C13H14IN7/c1-19-2-4-20(5-3-19)12-13-18-16-8-21(13)10-6-9(14)7-15-11(10)17-12/h6-8H,2-5H2,1H3
Reactome pathway
n/an/a>1.00E+5n/an/an/an/an/an/a
TBA
Assay Description
Displacement of [3H]-N-alpha-methylhistamine from recombinant human histamine H3 receptor expressed in CHO-K1 cell membranes measured after 30 mins b...
Citation and Details
Article DOI: 10.1021/acs.jmedchem.7b01855
BindingDB Entry DOI: 10.7270/Q2ZG6WZQ
Histamine H4 receptor
(Homo sapiens (Human))
BDBM294386
(US9586959, Compound 49)
Show SMILES CN1CCN(CC1)c1nc2ncc(I)cc2n2cnnc12
Show InChI InChI=1S/C13H14IN7/c1-19-2-4-20(5-3-19)12-13-18-16-8-21(13)10-6-9(14)7-15-11(10)17-12/h6-8H,2-5H2,1H3
Reactome pathway
n/an/a 34n/an/an/an/an/an/a
TBA
Assay Description
Displacement of [3H]-histamine from recombinant human histamine H4 receptor expressed in CHO-K1 cell membranes measured after 30 mins by microbeta sc...
Citation and Details
Article DOI: 10.1021/acs.jmedchem.7b01855
BindingDB Entry DOI: 10.7270/Q2ZG6WZQ
Histamine H3 receptor
(Homo sapiens (Human))
BDBM294386
(US9586959, Compound 49)
Show SMILES CN1CCN(CC1)c1nc2ncc(I)cc2n2cnnc12
Show InChI InChI=1S/C13H14IN7/c1-19-2-4-20(5-3-19)12-13-18-16-8-21(13)10-6-9(14)7-15-11(10)17-12/h6-8H,2-5H2,1H3
Reactome pathway
US Patent
n/an/a>1.00E+8n/an/an/an/a7.427
C&C RESEARCH LABORATORIES
US Patent
Assay Description
Each compound of the present invention prepared in the examples was prepared in DMSO into concentrations of 0.02, 0.06, 0.3 and 2 mM. 10 uL of the pr...
US Patent US9586959 (2017)
BindingDB Entry DOI: 10.7270/Q2C53NWD