BDBM294623 US10112899, Example 103
SMILES: Cc1c2CN(Cc2c(C)c(-c2cc(F)c3OCCCc3c2C)c1[C@H](OC(C)(C)C)C(O)=O)C(=O)c1cccc(F)c1
InChI Key: InChIKey=YHHACMRTVOXJRY-PMERELPUSA-N
Data: 1 IC50
Activity Spreadsheet -- Enzyme Inhibition Constant Data from BindingDB
Found 1 hit for monomerid = 294623
Trg + Lig
Ki
nM
ΔG°
kcal/mole
IC50
nM
Kd
nM
EC50/IC50
nM
koff
s-1
kon
M-1s-1
pHTemp
°C
Human immunodeficiency virus type 1 integrase
(Human immunodeficiency virus 1)
BDBM294623
(US10112899, Example 103)
Show SMILES Cc1c2CN(Cc2c(C)c(-c2cc(F)c3OCCCc3c2C)c1[C@H](OC(C)(C)C)C(O)=O)C(=O)c1cccc(F)c1 |r,wD:23.27,(3.62,-2.17,;2.29,-1.4,;.95,-2.17,;.63,-3.68,;-.9,-3.84,;-1.52,-2.43,;-.38,-1.4,;-.38,.14,;-1.71,.91,;.95,.91,;.95,2.45,;2.29,3.22,;2.29,4.76,;3.62,5.53,;.95,5.53,;.95,7.07,;-.38,7.84,;-1.71,7.07,;-1.71,5.53,;-.38,4.76,;-.38,3.22,;-1.71,2.45,;2.29,.14,;3.62,.91,;3.62,2.45,;4.95,3.22,;6.29,2.45,;4.95,4.76,;6.29,3.99,;4.95,.14,;6.29,.91,;4.95,-1.4,;-1.67,-5.17,;-.9,-6.51,;-3.21,-5.17,;-3.98,-3.84,;-5.52,-3.84,;-6.29,-5.17,;-5.52,-6.51,;-6.29,-7.84,;-3.98,-6.51,)|
Show InChI InChI=1S/C33H35F2NO5/c1-17-22-11-8-12-40-29(22)26(35)14-23(17)27-18(2)24-15-36(31(37)20-9-7-10-21(34)13-20)16-25(24)19(3)28(27)30(32(38)39)41-33(4,5)6/h7,9-10,13-14,30H,8,11-12,15-16H2,1-6H3,(H,38,39)/t30-/m0/s1
US Patent
n/an/a 2n/an/an/an/an/an/a
ViiV HEALTHCARE UK LIMITED
US Patent
Assay Description
Antiviral HIV activity and cytotoxicity values for compounds of the invention from Table 1 were measured in parallel in the HTLV-1 transformed cell l...
US Patent US10112899 (2018)
BindingDB Entry DOI: 10.7270/Q2KP8465