null
SMILES: CCC(CC)Nc1nc(C)nc2c(c(C)nn12)-c1cc(F)c(OC)cc1Cl
InChI Key: InChIKey=MHRACNFYWWSGFM-UHFFFAOYSA-N
Activity Spreadsheet -- Enzyme Inhibition Constant Data from BindingDB
Found 1 hit for monomerid = 29466
Trg + Lig
Ki
nM
ΔG°
kcal/mole
IC50
nM
Kd
nM
EC50/IC50
nM
koff
s-1
kon
M-1s-1
pHTemp
°C
Corticotropin-releasing factor receptor 1
(Rattus norvegicus (rat))
BDBM29466
(Pyrazolo[1,5-a]-1,3,5-triazine, 12-35)
Show SMILES CCC(CC)Nc1nc(C)nc2c(c(C)nn12)-c1cc(F)c(OC)cc1Cl |(2.48,7.45,;.99,7.08,;-.08,8.19,;.35,9.67,;1.85,10.04,;-1.57,7.83,;-2.07,6.37,;-3.58,6.06,;-4.07,4.61,;-5.58,4.3,;-3.05,3.45,;-1.54,3.75,;-.31,2.83,;.95,3.72,;2.41,3.23,;.49,5.19,;-1.05,5.21,;-.33,1.29,;-1.66,.52,;-1.66,-1.02,;-2.99,-1.79,;-.33,-1.79,;-.33,-3.33,;1.01,-4.1,;1.01,-1.02,;1.01,.52,;2.34,1.29,)|
Show InChI InChI=1S/C19H23ClFN5O/c1-6-12(7-2)24-19-23-11(4)22-18-17(10(3)25-26(18)19)13-8-15(21)16(27-5)9-14(13)20/h8-9,12H,6-7H2,1-5H3,(H,22,23,24)
Reactome pathway
n/an/a 1n/an/an/an/an/a25
Bristol-Myers Squibb Company
Assay Description
Naive rats were sacrificed by decapitation, and the brain and pituitary were collected. Slide-mounted brain sections were preincubated in an assay so...
J Med Chem 52: 3073-83 (2009)
Article DOI: 10.1021/jm9000242
BindingDB Entry DOI: 10.7270/Q23R0R6X