null
SMILES: CCC(CC)Nc1nc(C)nc2c(c(C)nn12)-c1ccc(OC)c(C)c1C
InChI Key: InChIKey=UTEWLEXAJLMPSL-UHFFFAOYSA-N
Activity Spreadsheet -- Enzyme Inhibition Constant Data from BindingDB
Found 1 hit for monomerid = 29475
Trg + Lig
Ki
nM
ΔG°
kcal/mole
IC50
nM
Kd
nM
EC50/IC50
nM
koff
s-1
kon
M-1s-1
pHTemp
°C
Corticotropin-releasing factor receptor 1
(Rattus norvegicus (rat))
BDBM29475
(Pyrazolo[1,5-a]-1,3,5-triazine, 12-44)
Show SMILES CCC(CC)Nc1nc(C)nc2c(c(C)nn12)-c1ccc(OC)c(C)c1C |(1.85,10.04,;.35,9.67,;-.08,8.19,;.99,7.08,;2.48,7.48,;-1.57,7.83,;-2.07,6.37,;-3.58,6.06,;-4.07,4.61,;-5.58,4.3,;-3.05,3.45,;-1.54,3.75,;-.31,2.83,;.95,3.72,;2.41,3.23,;.49,5.19,;-1.05,5.21,;-.33,1.29,;-1.66,.52,;-1.66,-1.02,;-.33,-1.79,;-.33,-3.33,;1.01,-4.1,;1.01,-1.02,;2.34,-1.79,;1.01,.52,;2.34,1.29,)|
Show InChI InChI=1S/C21H29N5O/c1-8-16(9-2)24-21-23-15(6)22-20-19(14(5)25-26(20)21)17-10-11-18(27-7)13(4)12(17)3/h10-11,16H,8-9H2,1-7H3,(H,22,23,24)
Reactome pathway
n/an/a 11.3n/an/an/an/an/a25
Bristol-Myers Squibb Company
Assay Description
Naive rats were sacrificed by decapitation, and the brain and pituitary were collected. Slide-mounted brain sections were preincubated in an assay so...
J Med Chem 52: 3073-83 (2009)
Article DOI: 10.1021/jm9000242
BindingDB Entry DOI: 10.7270/Q23R0R6X