BDBM29490 Pyrazolo[1,5-a]-1,3,5-triazine, 13-15
SMILES: CC[C@@H](C)Nc1nc(C)nc2c(c(C)nn12)-c1ccc(OC)nc1C
InChI Key: InChIKey=LBWQSAZEYIZZCE-SNVBAGLBSA-N
Data: 6 IC50
Activity Spreadsheet -- Enzyme Inhibition Constant Data from BindingDB
Found 6 hits for monomerid = 29490
Trg + Lig
Ki
nM
ΔG°
kcal/mole
IC50
nM
Kd
nM
EC50/IC50
nM
koff
s-1
kon
M-1s-1
pHTemp
°C
Corticotropin-releasing factor receptor 1
(Rattus norvegicus (rat))
BDBM29490
(Pyrazolo[1,5-a]-1,3,5-triazine, 13-15)
Show SMILES CC[C@@H](C)Nc1nc(C)nc2c(c(C)nn12)-c1ccc(OC)nc1C |r,wD:2.2,(2.48,7.4,;.99,7,;-.06,8.13,;.34,9.62,;-1.57,7.83,;-2.07,6.37,;-3.58,6.06,;-4.07,4.61,;-5.58,4.3,;-3.05,3.45,;-1.54,3.75,;-.31,2.83,;.95,3.72,;2.41,3.23,;.49,5.19,;-1.05,5.21,;-.33,1.29,;-1.66,.52,;-1.66,-1.02,;-.33,-1.79,;-.33,-3.33,;1.01,-4.1,;1.01,-1.02,;1.01,.52,;2.34,1.29,)|
Show InChI InChI=1S/C18H24N6O/c1-7-10(2)19-18-22-13(5)21-17-16(12(4)23-24(17)18)14-8-9-15(25-6)20-11(14)3/h8-10H,7H2,1-6H3,(H,19,21,22)/t10-/m1/s1
Reactome pathway
n/an/a 6.10n/an/an/an/a7.223
Bristol-Myers Squibb Company
Assay Description
Naive rats were sacrificed by decapitation, and the brain and pituitary were collected. Slide-mounted brain sections were preincubated in an assay so...
J Med Chem 52: 3084-92 (2009)
Article DOI: 10.1021/jm900025h
BindingDB Entry DOI: 10.7270/Q20000D0
Corticotropin-releasing factor-binding protein
(Homo sapiens (Human))
BDBM29490
(Pyrazolo[1,5-a]-1,3,5-triazine, 13-15)
Show SMILES CC[C@@H](C)Nc1nc(C)nc2c(c(C)nn12)-c1ccc(OC)nc1C |r,wD:2.2,(2.48,7.4,;.99,7,;-.06,8.13,;.34,9.62,;-1.57,7.83,;-2.07,6.37,;-3.58,6.06,;-4.07,4.61,;-5.58,4.3,;-3.05,3.45,;-1.54,3.75,;-.31,2.83,;.95,3.72,;2.41,3.23,;.49,5.19,;-1.05,5.21,;-.33,1.29,;-1.66,.52,;-1.66,-1.02,;-.33,-1.79,;-.33,-3.33,;1.01,-4.1,;1.01,-1.02,;1.01,.52,;2.34,1.29,)|
Show InChI InChI=1S/C18H24N6O/c1-7-10(2)19-18-22-13(5)21-17-16(12(4)23-24(17)18)14-8-9-15(25-6)20-11(14)3/h8-10H,7H2,1-6H3,(H,19,21,22)/t10-/m1/s1
n/an/a>1.00E+3n/an/an/an/an/an/a
Bristol-Myers Squibb Co.
Curated by ChEMBL
Assay Description
Binding affinity to CRF-binding protein (unknown origin)
Drug Metab Dispos 40: 1093-103 (2012)
Article DOI: 10.1124/dmd.111.043596
BindingDB Entry DOI: 10.7270/Q2C24Z52
Corticotropin-releasing factor receptor 1
(Homo sapiens (Human))
BDBM29490
(Pyrazolo[1,5-a]-1,3,5-triazine, 13-15)
Show SMILES CC[C@@H](C)Nc1nc(C)nc2c(c(C)nn12)-c1ccc(OC)nc1C |r,wD:2.2,(2.48,7.4,;.99,7,;-.06,8.13,;.34,9.62,;-1.57,7.83,;-2.07,6.37,;-3.58,6.06,;-4.07,4.61,;-5.58,4.3,;-3.05,3.45,;-1.54,3.75,;-.31,2.83,;.95,3.72,;2.41,3.23,;.49,5.19,;-1.05,5.21,;-.33,1.29,;-1.66,.52,;-1.66,-1.02,;-.33,-1.79,;-.33,-3.33,;1.01,-4.1,;1.01,-1.02,;1.01,.52,;2.34,1.29,)|
Show InChI InChI=1S/C18H24N6O/c1-7-10(2)19-18-22-13(5)21-17-16(12(4)23-24(17)18)14-8-9-15(25-6)20-11(14)3/h8-10H,7H2,1-6H3,(H,19,21,22)/t10-/m1/s1
Reactome pathway
n/an/a 340n/an/an/an/an/an/a
Takeda Pharmaceutical Company Ltd.
Curated by ChEMBL
Assay Description
Displacement of ovine [125-I]-CRF from human CRF1 receptor expressed in CHO cell membranes preincubated for 1 hr followed by [125I]-CRF addition meas...
Bioorg Med Chem 25: 1556-1570 (2017)
BindingDB Entry DOI: 10.7270/Q23R0W4P
Corticotropin-releasing factor receptor 1
(Rattus norvegicus (rat))
BDBM29490
(Pyrazolo[1,5-a]-1,3,5-triazine, 13-15)
Show SMILES CC[C@@H](C)Nc1nc(C)nc2c(c(C)nn12)-c1ccc(OC)nc1C |r,wD:2.2,(2.48,7.4,;.99,7,;-.06,8.13,;.34,9.62,;-1.57,7.83,;-2.07,6.37,;-3.58,6.06,;-4.07,4.61,;-5.58,4.3,;-3.05,3.45,;-1.54,3.75,;-.31,2.83,;.95,3.72,;2.41,3.23,;.49,5.19,;-1.05,5.21,;-.33,1.29,;-1.66,.52,;-1.66,-1.02,;-.33,-1.79,;-.33,-3.33,;1.01,-4.1,;1.01,-1.02,;1.01,.52,;2.34,1.29,)|
Show InChI InChI=1S/C18H24N6O/c1-7-10(2)19-18-22-13(5)21-17-16(12(4)23-24(17)18)14-8-9-15(25-6)20-11(14)3/h8-10H,7H2,1-6H3,(H,19,21,22)/t10-/m1/s1
Reactome pathway
n/an/a 6.10n/an/an/an/an/an/a
Neurogen Corporation
Curated by ChEMBL
Assay Description
Displacement of [125I]-sauvagine from rat CRF-1 receptor expressed in human IMR-32 cells after 2 hrs by scintillation counting
J Med Chem 54: 4187-206 (2011)
Article DOI: 10.1021/jm200365y
BindingDB Entry DOI: 10.7270/Q2XS5VR1
Corticotropin-releasing factor receptor 1
(Homo sapiens (Human))
BDBM29490
(Pyrazolo[1,5-a]-1,3,5-triazine, 13-15)
Show SMILES CC[C@@H](C)Nc1nc(C)nc2c(c(C)nn12)-c1ccc(OC)nc1C |r,wD:2.2,(2.48,7.4,;.99,7,;-.06,8.13,;.34,9.62,;-1.57,7.83,;-2.07,6.37,;-3.58,6.06,;-4.07,4.61,;-5.58,4.3,;-3.05,3.45,;-1.54,3.75,;-.31,2.83,;.95,3.72,;2.41,3.23,;.49,5.19,;-1.05,5.21,;-.33,1.29,;-1.66,.52,;-1.66,-1.02,;-.33,-1.79,;-.33,-3.33,;1.01,-4.1,;1.01,-1.02,;1.01,.52,;2.34,1.29,)|
Show InChI InChI=1S/C18H24N6O/c1-7-10(2)19-18-22-13(5)21-17-16(12(4)23-24(17)18)14-8-9-15(25-6)20-11(14)3/h8-10H,7H2,1-6H3,(H,19,21,22)/t10-/m1/s1
Reactome pathway
n/an/a>1.00E+4n/an/an/an/an/an/a
Takeda Pharmaceutical Company Ltd.
Curated by ChEMBL
Assay Description
Displacement of ovine [125-I]-CRF from human CRF1 receptor expressed in CHO cell membranes preincubated for 1 hr followed by compound washout for 2 h...
Bioorg Med Chem 25: 1556-1570 (2017)
BindingDB Entry DOI: 10.7270/Q23R0W4P
Corticotropin-releasing factor receptor 1
(Homo sapiens (Human))
BDBM29490
(Pyrazolo[1,5-a]-1,3,5-triazine, 13-15)
Show SMILES CC[C@@H](C)Nc1nc(C)nc2c(c(C)nn12)-c1ccc(OC)nc1C |r,wD:2.2,(2.48,7.4,;.99,7,;-.06,8.13,;.34,9.62,;-1.57,7.83,;-2.07,6.37,;-3.58,6.06,;-4.07,4.61,;-5.58,4.3,;-3.05,3.45,;-1.54,3.75,;-.31,2.83,;.95,3.72,;2.41,3.23,;.49,5.19,;-1.05,5.21,;-.33,1.29,;-1.66,.52,;-1.66,-1.02,;-.33,-1.79,;-.33,-3.33,;1.01,-4.1,;1.01,-1.02,;1.01,.52,;2.34,1.29,)|
Show InChI InChI=1S/C18H24N6O/c1-7-10(2)19-18-22-13(5)21-17-16(12(4)23-24(17)18)14-8-9-15(25-6)20-11(14)3/h8-10H,7H2,1-6H3,(H,19,21,22)/t10-/m1/s1
Reactome pathway
n/an/a 6.10n/an/an/an/an/an/a
Bristol-Myers Squibb Co.
Curated by ChEMBL
Assay Description
Antagonist activity at human CRF1 receptor
Drug Metab Dispos 40: 1093-103 (2012)
Article DOI: 10.1124/dmd.111.043596
BindingDB Entry DOI: 10.7270/Q2C24Z52