BDBM295065 US10112926, Example 19::trans 3-[6-Amino-5-(3-methyl-[1,2,4]oxadiazol-5-yl)-pyridin-3-yl]-N-(4-hydroxymethyl-cyclohexyl)-4-methyl-benzenesulfonamide hydrochloride
SMILES: Cc1noc(n1)-c1cc(cnc1N)-c1cc(ccc1C)S(=O)(=O)N[C@H]1CC[C@H](CO)CC1
InChI Key: InChIKey=NBCXNVNZDMPXJF-JCNLHEQBSA-N
Data: 7 IC50
Activity Spreadsheet -- Enzyme Inhibition Constant Data from BindingDB
Found 7 hits for monomerid = 295065
Trg + Lig
Ki
nM
ΔG°
kcal/mole
IC50
nM
Kd
nM
EC50/IC50
nM
koff
s-1
kon
M-1s-1
pHTemp
°C
PI3-kinase class I
(Homo sapiens (Human))
BDBM295065
(US10112926, Example 19 | trans 3-[6-Amino-5-(3-met...)
Show SMILES Cc1noc(n1)-c1cc(cnc1N)-c1cc(ccc1C)S(=O)(=O)N[C@H]1CC[C@H](CO)CC1 |r,wU:24.26,wD:27.30,(5.5,-.1,;4.73,1.23,;5.2,2.69,;3.96,3.6,;2.71,2.69,;3.19,1.23,;1.38,3.47,;.04,2.69,;-1.29,3.47,;-1.29,5,;.04,5.78,;1.38,5,;2.71,5.78,;-2.62,2.69,;-2.62,1.15,;-3.96,.38,;-5.29,1.15,;-5.29,2.69,;-3.96,3.47,;-3.96,5,;-3.96,-1.15,;-2.42,-1.15,;-5.5,-1.15,;-3.96,-2.69,;-2.62,-3.47,;-1.29,-2.69,;.04,-3.47,;.04,-5,;1.38,-5.78,;2.71,-5,;-1.29,-5.78,;-2.62,-5,)|
Show InChI InChI=1S/C22H27N5O4S/c1-13-3-8-18(32(29,30)27-17-6-4-15(12-28)5-7-17)10-19(13)16-9-20(21(23)24-11-16)22-25-14(2)26-31-22/h3,8-11,15,17,27-28H,4-7,12H2,1-2H3,(H2,23,24)/t15-,17-
US Patent
n/an/a 40n/an/an/an/a7.525
Novartis AG
US Patent
Assay Description
The luminescence-based ATP detection reagent KinaseGlo was obtained from Promega, (Cat. No. V6714, Lot No. 236161) through Catalys, Wallisellen, Swit...
US Patent US10112926 (2018)
BindingDB Entry DOI: 10.7270/Q22R3TQ9
Phosphatidylinositol 4,5-bisphosphate 3-kinase catalytic subunit beta isoform
(Homo sapiens (Human))
BDBM295065
(US10112926, Example 19 | trans 3-[6-Amino-5-(3-met...)
Show SMILES Cc1noc(n1)-c1cc(cnc1N)-c1cc(ccc1C)S(=O)(=O)N[C@H]1CC[C@H](CO)CC1 |r,wU:24.26,wD:27.30,(5.5,-.1,;4.73,1.23,;5.2,2.69,;3.96,3.6,;2.71,2.69,;3.19,1.23,;1.38,3.47,;.04,2.69,;-1.29,3.47,;-1.29,5,;.04,5.78,;1.38,5,;2.71,5.78,;-2.62,2.69,;-2.62,1.15,;-3.96,.38,;-5.29,1.15,;-5.29,2.69,;-3.96,3.47,;-3.96,5,;-3.96,-1.15,;-2.42,-1.15,;-5.5,-1.15,;-3.96,-2.69,;-2.62,-3.47,;-1.29,-2.69,;.04,-3.47,;.04,-5,;1.38,-5.78,;2.71,-5,;-1.29,-5.78,;-2.62,-5,)|
Show InChI InChI=1S/C22H27N5O4S/c1-13-3-8-18(32(29,30)27-17-6-4-15(12-28)5-7-17)10-19(13)16-9-20(21(23)24-11-16)22-25-14(2)26-31-22/h3,8-11,15,17,27-28H,4-7,12H2,1-2H3,(H2,23,24)/t15-,17-
NCI pathway
Reactome pathway
US Patent
n/an/a 100n/an/an/an/a7.525
Novartis AG
US Patent
Assay Description
The luminescence-based ATP detection reagent KinaseGlo was obtained from Promega, (Cat. No. V6714, Lot No. 236161) through Catalys, Wallisellen, Swit...
US Patent US10112926 (2018)
BindingDB Entry DOI: 10.7270/Q22R3TQ9
Phosphatidylinositol 3-kinase catalytic subunit type 3
(Homo sapiens (Human))
BDBM295065
(US10112926, Example 19 | trans 3-[6-Amino-5-(3-met...)
Show SMILES Cc1noc(n1)-c1cc(cnc1N)-c1cc(ccc1C)S(=O)(=O)N[C@H]1CC[C@H](CO)CC1 |r,wU:24.26,wD:27.30,(5.5,-.1,;4.73,1.23,;5.2,2.69,;3.96,3.6,;2.71,2.69,;3.19,1.23,;1.38,3.47,;.04,2.69,;-1.29,3.47,;-1.29,5,;.04,5.78,;1.38,5,;2.71,5.78,;-2.62,2.69,;-2.62,1.15,;-3.96,.38,;-5.29,1.15,;-5.29,2.69,;-3.96,3.47,;-3.96,5,;-3.96,-1.15,;-2.42,-1.15,;-5.5,-1.15,;-3.96,-2.69,;-2.62,-3.47,;-1.29,-2.69,;.04,-3.47,;.04,-5,;1.38,-5.78,;2.71,-5,;-1.29,-5.78,;-2.62,-5,)|
Show InChI InChI=1S/C22H27N5O4S/c1-13-3-8-18(32(29,30)27-17-6-4-15(12-28)5-7-17)10-19(13)16-9-20(21(23)24-11-16)22-25-14(2)26-31-22/h3,8-11,15,17,27-28H,4-7,12H2,1-2H3,(H2,23,24)/t15-,17-
Reactome pathway
US Patent
n/an/a>1.00E+4n/an/an/an/a7.525
Novartis AG
US Patent
Assay Description
The luminescence-based ATP detection reagent KinaseGlo was obtained from Promega, (Cat. No. V6714, Lot No. 236161) through Catalys, Wallisellen, Swit...
US Patent US10112926 (2018)
BindingDB Entry DOI: 10.7270/Q22R3TQ9
Serine/threonine-protein kinase mTOR
(Homo sapiens (Human))
BDBM295065
(US10112926, Example 19 | trans 3-[6-Amino-5-(3-met...)
Show SMILES Cc1noc(n1)-c1cc(cnc1N)-c1cc(ccc1C)S(=O)(=O)N[C@H]1CC[C@H](CO)CC1 |r,wU:24.26,wD:27.30,(5.5,-.1,;4.73,1.23,;5.2,2.69,;3.96,3.6,;2.71,2.69,;3.19,1.23,;1.38,3.47,;.04,2.69,;-1.29,3.47,;-1.29,5,;.04,5.78,;1.38,5,;2.71,5.78,;-2.62,2.69,;-2.62,1.15,;-3.96,.38,;-5.29,1.15,;-5.29,2.69,;-3.96,3.47,;-3.96,5,;-3.96,-1.15,;-2.42,-1.15,;-5.5,-1.15,;-3.96,-2.69,;-2.62,-3.47,;-1.29,-2.69,;.04,-3.47,;.04,-5,;1.38,-5.78,;2.71,-5,;-1.29,-5.78,;-2.62,-5,)|
Show InChI InChI=1S/C22H27N5O4S/c1-13-3-8-18(32(29,30)27-17-6-4-15(12-28)5-7-17)10-19(13)16-9-20(21(23)24-11-16)22-25-14(2)26-31-22/h3,8-11,15,17,27-28H,4-7,12H2,1-2H3,(H2,23,24)/t15-,17-
NCI pathway
Reactome pathway
US Patent
n/an/a>1.00E+4n/an/an/an/a7.5n/a
Novartis AG
US Patent
Assay Description
Binding Assays are based on the binding and displacement of an Alexa Fluor 647-labeled, ATP-competitive kinase inhibitors to the kinase of interest. ...
US Patent US10112926 (2018)
BindingDB Entry DOI: 10.7270/Q22R3TQ9
Phosphatidylinositol 4,5-bisphosphate 3-kinase catalytic subunit gamma isoform
(Homo sapiens (Human))
BDBM295065
(US10112926, Example 19 | trans 3-[6-Amino-5-(3-met...)
Show SMILES Cc1noc(n1)-c1cc(cnc1N)-c1cc(ccc1C)S(=O)(=O)N[C@H]1CC[C@H](CO)CC1 |r,wU:24.26,wD:27.30,(5.5,-.1,;4.73,1.23,;5.2,2.69,;3.96,3.6,;2.71,2.69,;3.19,1.23,;1.38,3.47,;.04,2.69,;-1.29,3.47,;-1.29,5,;.04,5.78,;1.38,5,;2.71,5.78,;-2.62,2.69,;-2.62,1.15,;-3.96,.38,;-5.29,1.15,;-5.29,2.69,;-3.96,3.47,;-3.96,5,;-3.96,-1.15,;-2.42,-1.15,;-5.5,-1.15,;-3.96,-2.69,;-2.62,-3.47,;-1.29,-2.69,;.04,-3.47,;.04,-5,;1.38,-5.78,;2.71,-5,;-1.29,-5.78,;-2.62,-5,)|
Show InChI InChI=1S/C22H27N5O4S/c1-13-3-8-18(32(29,30)27-17-6-4-15(12-28)5-7-17)10-19(13)16-9-20(21(23)24-11-16)22-25-14(2)26-31-22/h3,8-11,15,17,27-28H,4-7,12H2,1-2H3,(H2,23,24)/t15-,17-
NCI pathway
Reactome pathway
US Patent
n/an/a<3n/an/an/an/a7.5n/a
Novartis AG
US Patent
Assay Description
The TR-FRET Adapta Universal Kinase Assay Kit was purchased from Invitrogen Corporation (Carlsbad, Calif., USA) (Cat. No. PV5099). The kit contains t...
US Patent US10112926 (2018)
BindingDB Entry DOI: 10.7270/Q22R3TQ9
Phosphatidylinositol 4,5-bisphosphate 3-kinase catalytic subunit delta isoform
(Homo sapiens (Human))
BDBM295065
(US10112926, Example 19 | trans 3-[6-Amino-5-(3-met...)
Show SMILES Cc1noc(n1)-c1cc(cnc1N)-c1cc(ccc1C)S(=O)(=O)N[C@H]1CC[C@H](CO)CC1 |r,wU:24.26,wD:27.30,(5.5,-.1,;4.73,1.23,;5.2,2.69,;3.96,3.6,;2.71,2.69,;3.19,1.23,;1.38,3.47,;.04,2.69,;-1.29,3.47,;-1.29,5,;.04,5.78,;1.38,5,;2.71,5.78,;-2.62,2.69,;-2.62,1.15,;-3.96,.38,;-5.29,1.15,;-5.29,2.69,;-3.96,3.47,;-3.96,5,;-3.96,-1.15,;-2.42,-1.15,;-5.5,-1.15,;-3.96,-2.69,;-2.62,-3.47,;-1.29,-2.69,;.04,-3.47,;.04,-5,;1.38,-5.78,;2.71,-5,;-1.29,-5.78,;-2.62,-5,)|
Show InChI InChI=1S/C22H27N5O4S/c1-13-3-8-18(32(29,30)27-17-6-4-15(12-28)5-7-17)10-19(13)16-9-20(21(23)24-11-16)22-25-14(2)26-31-22/h3,8-11,15,17,27-28H,4-7,12H2,1-2H3,(H2,23,24)/t15-,17-
NCI pathway
Reactome pathway
US Patent
n/an/a 110n/an/an/an/a7.5n/a
Novartis AG
US Patent
Assay Description
The TR-FRET Adapta Universal Kinase Assay Kit was purchased from Invitrogen Corporation (Carlsbad, Calif., USA) (Cat. No. PV5099). The kit contains t...
US Patent US10112926 (2018)
BindingDB Entry DOI: 10.7270/Q22R3TQ9
Phosphatidylinositol 4-kinase beta
(Homo sapiens (Human))
BDBM295065
(US10112926, Example 19 | trans 3-[6-Amino-5-(3-met...)
Show SMILES Cc1noc(n1)-c1cc(cnc1N)-c1cc(ccc1C)S(=O)(=O)N[C@H]1CC[C@H](CO)CC1 |r,wU:24.26,wD:27.30,(5.5,-.1,;4.73,1.23,;5.2,2.69,;3.96,3.6,;2.71,2.69,;3.19,1.23,;1.38,3.47,;.04,2.69,;-1.29,3.47,;-1.29,5,;.04,5.78,;1.38,5,;2.71,5.78,;-2.62,2.69,;-2.62,1.15,;-3.96,.38,;-5.29,1.15,;-5.29,2.69,;-3.96,3.47,;-3.96,5,;-3.96,-1.15,;-2.42,-1.15,;-5.5,-1.15,;-3.96,-2.69,;-2.62,-3.47,;-1.29,-2.69,;.04,-3.47,;.04,-5,;1.38,-5.78,;2.71,-5,;-1.29,-5.78,;-2.62,-5,)|
Show InChI InChI=1S/C22H27N5O4S/c1-13-3-8-18(32(29,30)27-17-6-4-15(12-28)5-7-17)10-19(13)16-9-20(21(23)24-11-16)22-25-14(2)26-31-22/h3,8-11,15,17,27-28H,4-7,12H2,1-2H3,(H2,23,24)/t15-,17-
US Patent
n/an/a 1.30E+3n/an/an/an/a7.525
Novartis AG
US Patent
Assay Description
The luminescence-based ATP detection reagent KinaseGlo was obtained from Promega, (Cat. No. V6714, Lot No. 236161) through Catalys, Wallisellen, Swit...
US Patent US10112926 (2018)
BindingDB Entry DOI: 10.7270/Q22R3TQ9